{"text_format":"1","workbook":"xlsx","n_sheets":5,"sheets":["LDB Übersicht","Raumabsorption","LDB Auswahl","Liste","Legende"],"not_rendered":{"charts":0,"images":61,"macros":1,"external_links":0,"defined_names":6,"comments":1,"pivot_tables":0},"unopened":[],"bounds":{"document_bytes":16777216,"sheet_cells":100000,"rows_first":2000,"rows_last":500,"rows_between":2000,"halvings":0,"cell_chars":16384,"cell_head_chars":4096},"cells_cut":0,"cells_raw":0,"read":"whole","date_system":"1900"}

{"sheet":"LDB Übersicht","index":0,"n_rows":42,"n_cols":77,"rows_kept":42,"cut":false,"hidden":false,"merged":[[4,6,4,10],[3,6,3,10],[5,6,5,10],[6,6,6,10],[7,6,7,10],[8,6,8,10],[9,6,9,10],[10,6,10,10],[15,8,16,9],[17,8,17,9],[17,6,17,7],[15,6,16,7],[8,4,8,5],[6,4,6,5],[3,2,3,3],[4,2,4,3],[7,4,7,5],[6,2,6,3],[7,2,7,3],[8,2,8,3],[10,2,10,3],[10,4,10,5],[11,2,17,2],[13,14,16,14],[9,2,9,3],[9,4,9,5],[15,12,16,13],[17,12,17,13],[14,11,16,11],[15,10,16,10],[13,19,14,19],[14,20,17,20],[11,15,12,20],[17,17,17,18],[16,17,16,18],[15,17,15,18],[13,17,14,18],[13,15,16,16],[17,15,17,16],[4,11,4,14],[5,13,5,14],[5,11,5,12],[6,13,6,14],[6,11,6,12],[7,11,7,12],[7,13,7,14],[10,13,10,14],[9,13,9,14],[8,13,8,14],[8,11,8,12],[9,11,9,12],[10,11,10,12],[15,21,17,21],[15,22,17,23],[15,24,17,24],[11,21,14,24],[6,21,6,24],[24,30,24,51],[29,30,29,51],[15,69,15,72],[16,74,16,75],[16,52,16,59],[16,41,16,51],[16,30,16,40],[16,60,16,67],[16,68,17,68]]}
[]
[]
[null,null,{"$f":"IF($E$4=$AC$3,Legende!A7,IF($E$4=$AC$4,Legende!B7,IF($E$4=$AC$5,Legende!C7,IF($E$4=$AC$6,Legende!D7))))","v":"LTG Linear Diffusers Type LDB and LDB System Clean"},null,null,null,null,null,null,null,null,null,null,null,null,null,null,null,null,null,null,null,null,null,null,null,null,null,"Deutsch",{"$f":"IF($E$4=$AC$3,$AD$5,IF($E$4=$AC$4,$AD$6,IF($E$4=$AC$5,$AD$7,IF($E$4=$AC$6,$AD$8))))","v":"metrical"},{"$f":"IF($E$4=$AC$3,AE$4,IF($E$4=$AC$4,AE$5,IF($E$4=$AC$5,AE$6,IF($E$4=$AC$6,AE$7))))","v":"To the list"},{"$f":"IF($E$4=$AC$3,AF$4,IF($E$4=$AC$4,AF$5,IF($E$4=$AC$5,AF$6,IF($E$4=$AC$6,AF$7))))","v":"Calculation aid for room absorption"},{"$f":"IF($E$4=$AC$3,AG$4,IF($E$4=$AC$4,AG$5,IF($E$4=$AC$5,AG$6,IF($E$4=$AC$6,AG$7))))","v":"Edit the selected LDB type!"},{"$f":"IF($E$4=$AC$3,AH$4,IF($E$4=$AC$4,AH$5,IF($E$4=$AC$5,AH$6,IF($E$4=$AC$6,AH$7))))","v":"Permissible sound pressure level"},{"$f":"IF('LDB Übersicht'!$E$4='LDB Übersicht'!$AC$3,AI4,IF('LDB Übersicht'!$E$4='LDB Übersicht'!$AC$4,AI5,IF('LDB Übersicht'!$E$4='LDB Übersicht'!$AC$5,AI6,IF('LDB Übersicht'!$E$4='LDB Übersicht'!$AC$6,AI7))))","v":"Print overview"},"500 mm","19,50 in","300 mm","11,70 in",null," "]
[null,null,{"$f":"IF($E$4=$AC$3,Legende!A8,IF($E$4=$AC$4,Legende!B8,IF($E$4=$AC$5,Legende!C8,IF($E$4=$AC$6,Legende!D8))))","v":"language:"},null,"English",null,{"$f":"IF($E$4=$AC$3,Legende!A10,IF($E$4=$AC$4,Legende!B10,IF($E$4=$AC$5,Legende!C10,IF($E$4=$AC$6,Legende!D10))))","v":"Room data:"},null,null,null,null,null,null,null,null,null,null,null,null,null,null,null,null,null,null,null,null,null,"English",{"$f":"IF($E$4=$AC$3,$AD$9,IF($E$4=$AC$4,$AD$10,IF($E$4=$AC$5,$AD$11,IF($E$4=$AC$6,$AD$12))))","v":"imperial"},"zur Liste","Berechnungshilfe Raumabsorption","Gewählten LDB Typ bearbeiten!","Zulässige Schalldruckpegel","Übersicht drucken","750 mm","29,25 in","600 mm","23,40 in",null," "]
[null,null,{"$f":"IF($E$4=$AC$3,Legende!A9,IF($E$4=$AC$4,Legende!B9,IF($E$4=$AC$5,Legende!C9,IF($E$4=$AC$6,Legende!D9))))","v":"unit:"},null,"imperial",null,{"$f":"IF($E$4=$AC$3,Legende!A11,IF($E$4=$AC$4,Legende!B11,IF($E$4=$AC$5,Legende!C11,IF($E$4=$AC$6,Legende!D11))))","v":"Room name:"},null,null,null,null,null,null,null,null,null,null,null,null,null,null,null,null,null,null,null,null,null,"Francais","metrisch","To the list","Calculation aid for room absorption","Edit the selected LDB type!","Permissible sound pressure level","Print overview","1000 mm","39,00 in","900 mm","35,10 in",null," "]
[null,null,null,null,null,null,{"$f":"IF($E$4=$AC$3,Legende!A12,IF($E$4=$AC$4,Legende!B12,IF($E$4=$AC$5,Legende!C12,IF($E$4=$AC$6,Legende!D12))))","v":"Target total air flow rate:"},null,null,null,null,587.5,null,{"$f":"IF(OR($E$5=$AD$5,$E$5=$AD$6,$E$5=$AD$7,$E$5=$AD$8),\"m³/h\",IF(OR($E$5=$AD$9,$E$5=$AD$10,$E$5=$AD$11,$E$5=$AD$12),\"cfm\",\"\"))","v":"cfm"},null,null,null,null,null,null,null,"E-Mail: Info@LTG.de ",null,null,null,null,null,null,"Italiano","metrical","À la liste","Aide au calcul pour l'absorption de la pièce","Modifiez le type LDB sélectionné!","Niveau de pression acoustique admissible","Aperçu de l'impression","1250 mm","48,75 in","1200 mm","46,80 in",null," "]
[null,null,{"$f":"IF($E$4=$AC$3,Legende!A5,IF($E$4=$AC$4,Legende!B5,IF($E$4=$AC$5,Legende!C5,IF($E$4=$AC$6,Legende!D5))))","v":"Date:"},null,"2021-07-29",null,{"$f":"IF($E$4=$AC$3,Legende!A13,IF($E$4=$AC$4,Legende!B13,IF($E$4=$AC$5,Legende!C13,IF($E$4=$AC$6,Legende!D13))))","v":"Room air temperature:"},null,null,null,null,78.800000000000011,null,{"$f":"IF(OR($E$5=$AD$5,$E$5=$AD$6,$E$5=$AD$7,$E$5=$AD$8),\"°C\",IF(OR($E$5=$AD$9,$E$5=$AD$10,$E$5=$AD$11,$E$5=$AD$12),\"°F\",\"\"))","v":"°F"},null,null,null,null,null,null,null,"Tel. +49 (0)711 8201-0",null,null,null,null,null,null,"English","métrique","Alla lista","Aiuto per il calcolo dell'assorbimento ambientale","Modifica il tipo di LDB selezionato!","Livello di pressione sonora ammissibile","Panoramica della stampa","1500 mm","58,50 in","1500 mm","58,50 in",null," "]
[null,null,{"$f":"IF($E$4=$AC$3,Legende!A4,IF($E$4=$AC$4,Legende!B4,IF($E$4=$AC$5,Legende!C4,IF($E$4=$AC$6,Legende!D4))))","v":"Editor:"},null,null,null,{"$f":"IF($E$4=$AC$3,Legende!A14,IF($E$4=$AC$4,Legende!B14,IF($E$4=$AC$5,Legende!C14,IF($E$4=$AC$6,Legende!D14))))","v":"Supply air temperature:"},null,null,null,null,69.800000000000011,null,{"$f":"IF(OR($E$5=$AD$5,$E$5=$AD$6,$E$5=$AD$7,$E$5=$AD$8),\"°C\",IF(OR($E$5=$AD$9,$E$5=$AD$10,$E$5=$AD$11,$E$5=$AD$12),\"°F\",\"\"))","v":"°F"},null,null,null,null,null,null,null,null,null,null,null,null,null,null,{"$f":"IF(AC7=E4,0,1)","v":0},"metrico",null,null,null,null,null,"1750 mm","68,25 in","1800 mm","70,20 in"]
[null,null,{"$f":"IF($E$4=$AC$3,Legende!A2,IF($E$4=$AC$4,Legende!B2,IF($E$4=$AC$5,Legende!C2,IF($E$4=$AC$6,Legende!D2))))","v":"Project:"},null,null,null,{"$f":"IF($E$4=$AC$3,Legende!A15,IF($E$4=$AC$4,Legende!B15,IF($E$4=$AC$5,Legende!C15,IF($E$4=$AC$6,Legende!D15))))","v":"Room sound absorpion:"},null,null,null,null,6.4,null,"dB",null,null,null,null,null,null,null,null,null,null,null,null,null,null,null,"imperial",null,null,null,null,null,"2000 mm","78,00 in","2100 mm","81,90 in"]
[null,null,{"$f":"IF($E$4=$AC$3,Legende!A3,IF($E$4=$AC$4,Legende!B3,IF($E$4=$AC$5,Legende!C3,IF($E$4=$AC$6,Legende!D3))))","v":"Variant:"},null,null,null,{"$f":"IF($E$4=$AC$3,Legende!A16,IF($E$4=$AC$4,Legende!B16,IF($E$4=$AC$5,Legende!C16,IF($E$4=$AC$6,Legende!D16))))","v":"Sound pressure level limit in the room:"},null,null,null,null,35,null,"dB",null,null,null,null,null,null,null,null,null,null,null,null,null,null,null,"imperial"]
[null,null,{"$f":"IF($E$4=$AC$3,Legende!A6,IF($E$4=$AC$4,Legende!B6,IF($E$4=$AC$5,Legende!C6,IF($E$4=$AC$6,Legende!D6))))","v":"Order number:"},null,null,null,{"$f":"IF($E$4=$AC$3,Legende!A17,IF($E$4=$AC$4,Legende!B17,IF($E$4=$AC$5,Legende!C17,IF($E$4=$AC$6,Legende!D17))))","v":"Cooling capacity:"},null,null,null,null,{"$f":"IF(OR($E$5=$AD$5,$E$5=$AD$6,$E$5=$AD$7,$E$5=$AD$8),+ROUNDDOWN(AC16*L6/3,-1),IF(OR($E$5=$AD$9,$E$5=$AD$10,$E$5=$AD$11,$E$5=$AD$12),+ROUNDDOWN((AC16*L6/0.5875/3)*3.412141633128,-1)))","v":5680},null,{"$f":"IF(OR($E$5=$AD$5,$E$5=$AD$6,$E$5=$AD$7,$E$5=$AD$8),\"W\",IF(OR($E$5=$AD$9,$E$5=$AD$10,$E$5=$AD$11,$E$5=$AD$12),\"BTU/h\",\"\"))","v":"BTU/h"},null,null,null,null,null,null,null,null,null,null,null,null,null,null,null,"imperiale"]
[null,null,{"$f":"IF($E$4=$AC$3,Legende!A18,IF($E$4=$AC$4,Legende!B18,IF($E$4=$AC$5,Legende!C18,IF($E$4=$AC$6,Legende!D18))))","v":"<= Selected (with double click)"},null,null,null,null,null,null,null,null,null,null,null,null,{"$f":"IF($E$4=$AC$3,Legende!A41,IF($E$4=$AC$4,Legende!B41,IF($E$4=$AC$5,Legende!C41,IF($E$4=$AC$6,Legende!D41))))","v":"Evaluation of thermal comfort"},null,null,null,null,null,{"$f":"IF($E$4=$AC$3,Legende!A46,IF($E$4=$AC$4,Legende!B46,IF($E$4=$AC$5,Legende!C46,IF($E$4=$AC$6,Legende!D46))))","v":"Acoustic data of the standard configuration (LDBsmall, LDBmaxx: without throttle = SDA; LDBclean, LDBstyle, LDBclassic: throttle = DLU (100% open))"},null,null,null,null,null,null,null,"impérial"]
[]
[null,null,null,null,null,null,null,null,null,null,null,null,null,null,{"$f":"IF($E$4=$AC$3,Legende!A35,IF($E$4=$AC$4,Legende!B35,IF($E$4=$AC$5,Legende!C35,IF($E$4=$AC$6,Legende!D35))))","v":"Pressure loss"},{"$f":"IF($E$4=$AC$3,Legende!A36,IF($E$4=$AC$4,Legende!B36,IF($E$4=$AC$5,Legende!C36,IF($E$4=$AC$6,Legende!D36))))","v":"Jet spreading supply air "},null,{"$f":"IF($E$4=$AC$3,Legende!A37,IF($E$4=$AC$4,Legende!B37,IF($E$4=$AC$5,Legende!C37,IF($E$4=$AC$6,Legende!D37))))","v":"Max. air velocity"},null,{"$f":"IF($E$4=$AC$3,Legende!A39,IF($E$4=$AC$4,Legende!B39,IF($E$4=$AC$5,Legende!C39,IF($E$4=$AC$6,Legende!D39))))","v":"Draught risk"},null,null,null,null,null,null,null,null,{"$f":"IF(OR($E$5=$AD$5,$E$5=$AD$6,$E$5=$AD$7,$E$5=$AD$8),L7,((L7-32)/1.8))","v":26.000000000000007}]
[null,null,null,null,null,null,null,null,null,null,null,{"$f":"IF($E$4=$AC$3,Legende!A33,IF($E$4=$AC$4,Legende!B33,IF($E$4=$AC$5,Legende!C33,IF($E$4=$AC$6,Legende!D33))))","v":"Quantity"},null,null,null,null,null,null,null,null,{"$f":"IF($E$4=$AC$3,Legende!A40,IF($E$4=$AC$4,Legende!B40,IF($E$4=$AC$5,Legende!C40,IF($E$4=$AC$6,Legende!D40))))","v":"Category       DIN EN ISO 7730"},null,null,null,null,null,null,null,{"$f":"IF(OR($E$5=$AD$5,$E$5=$AD$6,$E$5=$AD$7,$E$5=$AD$8),L8,((L8-32)/1.8))","v":21.000000000000007}]
[null,null,null,null,null,null,{"$f":"IF($E$4=$AC$3,Legende!A30,IF($E$4=$AC$4,Legende!B30,IF($E$4=$AC$5,Legende!C30,IF($E$4=$AC$6,Legende!D30))))","v":"Specific air flow rate"},null,{"$f":"IF($E$4=$AC$3,Legende!A31,IF($E$4=$AC$4,Legende!B31,IF($E$4=$AC$5,Legende!C31,IF($E$4=$AC$6,Legende!D31))))","v":"Recommen-dation max."},null,{"$f":"IF($E$4=$AC$3,Legende!A32,IF($E$4=$AC$4,Legende!B32,IF($E$4=$AC$5,Legende!C32,IF($E$4=$AC$6,Legende!D32))))","v":"Diffuser element length"},null,{"$f":"IF($E$4=$AC$3,Legende!A34,IF($E$4=$AC$4,Legende!B34,IF($E$4=$AC$5,Legende!C34,IF($E$4=$AC$6,Legende!D34))))","v":"Diffuser length total room"},null,null,null,null,"cMAX",null,"DR",null,{"$f":"IF($E$4=$AC$3,Legende!A43,IF($E$4=$AC$4,Legende!B43,IF($E$4=$AC$5,Legende!C43,IF($E$4=$AC$6,Legende!D43))))","v":"A-rated sound power level per element"},{"$f":"IF($E$4=$AC$3,Legende!A44,IF($E$4=$AC$4,Legende!B44,IF($E$4=$AC$5,Legende!C44,IF($E$4=$AC$6,Legende!D44))))","v":"Actual total air flow rate"},null,{"$f":"IF($E$4=$AC$3,Legende!A45,IF($E$4=$AC$4,Legende!B45,IF($E$4=$AC$5,Legende!C45,IF($E$4=$AC$6,Legende!D45))))","v":"Sound pressure level in the room"},null,null,null,{"$f":"ROUNDDOWN(AC14-AC15,0)","v":5},null,null,null,null,null,null,null,null,null,null,null,null,null,null,null,null,null,null,null,null,null,null,null,null,null,null,null,null,null,null,null,null,null,null,null,null,null,null,null,null,"Srömungsakustik"]
[null,null,null,{"$f":"IF($E$4=$AC$3,Legende!A19,IF($E$4=$AC$4,Legende!B19,IF($E$4=$AC$5,Legende!C19,IF($E$4=$AC$6,Legende!D19))))","v":"LDB Type"},null,null,null,null,null,null,null,null,null,null,null,null,null,{"$f":"IF($E$4=$AC$3,Legende!A38,IF($E$4=$AC$4,Legende!B38,IF($E$4=$AC$5,Legende!C38,IF($E$4=$AC$6,Legende!D38))))","v":"Occupied zone"},null,{"$f":"IF(OR($E$5=$AD$5,$E$5=$AD$6,$E$5=$AD$7,$E$5=$AD$8),\"h(a)=1,70 m\",IF(OR($E$5=$AD$9,$E$5=$AD$10,$E$5=$AD$11,$E$5=$AD$12),\"h(a)=5,577 ft\",\"\"))","v":"h(a)=5,577 ft"},null,null,null,null,null,null,null,null,null,null,"Liste a in m bei c(max)",null,null,null,null,null,null,null,null,null,null,"Liste cMax",null,null,null,null,null,null,null,null,null,null,"Liste Standardstutzenanzahl",null,null,null,null,null,null,null,"Liste Standardstutzendurchmesser",null,null,null,null,null,null,null,"Volumenstrom","LWA/m Schlitz","LWA Kasten El.","LWASchlitz El.","LWA",null,"Standardeinstellung"]
[null,null,null,{"$f":"IF($E$4=$AC$3,Legende!A20,IF($E$4=$AC$4,Legende!B20,IF($E$4=$AC$5,Legende!C20,IF($E$4=$AC$6,Legende!D20))))","v":"Installation height H=2,80 m, LDB 50maxx H = 5,00 m"},null,null,"VPRO M IST",null,"VPRO M MAX",null,"LS",{"$f":"IF($E$4=$AC$3,Legende!A42,IF($E$4=$AC$4,Legende!B42,IF($E$4=$AC$5,Legende!C42,IF($E$4=$AC$6,Legende!D42))))","v":"pc."},"LGES",null,"Δp","a(cMAX)",null,{"$f":"IF(OR($E$5=$AD$5,$E$5=$AD$6,$E$5=$AD$7,$E$5=$AD$8),\"h=1,70 m\",IF(OR($E$5=$AD$9,$E$5=$AD$10,$E$5=$AD$11,$E$5=$AD$12),\"h=5,577 ft\",\"\"))","v":"h=5,577 ft"},null,"=> TU=40 %",null,null,null,null,null,null,null,null,"Länge","Bezugswert",3,4,5,6,7,8,9,10,11,12,"Auswahl",3,4,5,6,7,8,9,10,11,12,"Auswahl","Auswahl",500,750,1000,1250,1500,1750,2000,"Auswahl",500,750,1000,1250,1500,1750,2000,null,"TU Diagramm","Mess. Hoffmann","Mess. Hoffmann","Element","LDB Typ","Drossel","Einstellung","spez. Volumenstrom"]
[null,null,null,null,{"$f":"IF($E$4=$AC$3,Legende!A21,IF($E$4=$AC$4,Legende!B21,IF($E$4=$AC$5,Legende!C21,IF($E$4=$AC$6,Legende!D21))))","v":"LDB 12 small"},{"$f":"IF($E$4=$AC$3,Legende!A26,IF($E$4=$AC$4,Legende!B26,IF($E$4=$AC$5,Legende!C26,IF($E$4=$AC$6,Legende!D26))))","v":"1-slot"},28.200000000000003,{"$f":"IF(OR($E$5=$AD$5,$E$5=$AD$6,$E$5=$AD$7,$E$5=$AD$8),\"m³/(h*m)\",IF(OR($E$5=$AD$9,$E$5=$AD$10,$E$5=$AD$11,$E$5=$AD$12),\"cfm/ft\",\"\"))","v":"cfm/ft"},{"$f":"IF(OR($E$5=$AD$5,$E$5=$AD$6,$E$5=$AD$7,$E$5=$AD$8),70,IF(OR($E$5=$AD$9,$E$5=$AD$10,$E$5=$AD$11,$E$5=$AD$12),70*0.5875,\"\"))","v":41.125},{"$f":"IF(OR($E$5=$AD$5,$E$5=$AD$6,$E$5=$AD$7,$E$5=$AD$8),\"m³/(h*m)\",IF(OR($E$5=$AD$9,$E$5=$AD$10,$E$5=$AD$11,$E$5=$AD$12),\"cfm\",\"\"))","v":"cfm"},"39,00 in",{"$f":"IF((ROUNDUP($L$6/(G19*AC19/1000),0))=0,1,ROUNDUP($L$6/(G19*AC19/1000),0))","v":21},{"$f":"IF(OR($E$5=$AD$5,$E$5=$AD$6,$E$5=$AD$7,$E$5=$AD$8),AC19*L19/1000,IF(OR($E$5=$AD$9,$E$5=$AD$10,$E$5=$AD$11,$E$5=$AD$12),AC19*L19/1000*3.28084))","v":68.897639999999996},{"$f":"IF(OR($E$5=$AD$5,$E$5=$AD$6,$E$5=$AD$7,$E$5=$AD$8),\"m\",IF(OR($E$5=$AD$9,$E$5=$AD$10,$E$5=$AD$11,$E$5=$AD$12),\"ft\",\"\"))","v":"ft"},{"$f":"ROUND(1.5596*EXP(0.0724*AD19),0)","v":12},{"$f":"IF(OR($E$5=$AD$5,$E$5=$AD$6,$E$5=$AD$7,$E$5=$AD$8),AO19,IF(OR($E$5=$AD$9,$E$5=$AD$10,$E$5=$AD$11,$E$5=$AD$12),AO19*3.28084))","v":4.2650920000000001},{"$f":"IF(OR($E$5=$AD$5,$E$5=$AD$6,$E$5=$AD$7,$E$5=$AD$8),\"m\",IF(OR($E$5=$AD$9,$E$5=$AD$10,$E$5=$AD$11,$E$5=$AD$12),\"ft\",\"\"))","v":"ft"},{"$f":"IF(OR($E$5=$AD$5,$E$5=$AD$6,$E$5=$AD$7,$E$5=$AD$8),AZ19,IF(OR($E$5=$AD$9,$E$5=$AD$10,$E$5=$AD$11,$E$5=$AD$12),AZ19*3.28084))","v":0.39370079999999996},{"$f":"IF(OR($E$5=$AD$5,$E$5=$AD$6,$E$5=$AD$7,$E$5=$AD$8),\"m/s\",IF(OR($E$5=$AD$9,$E$5=$AD$10,$E$5=$AD$11,$E$5=$AD$12),\"ft/s\",\"\"))","v":"ft/s"},{"$f":"IF(OR($E$5=$AD$5,$E$5=$AD$6,$E$5=$AD$7,$E$5=$AD$8),ROUND(((34-$L$7)*((IF(AZ19<0.05,0.05,AZ19)-0.05)^0.62)*((0.37*IF(AZ19<0.05,0.05,AZ19)*40)+3.14)),0),IF(OR($E$5=$AD$9,$E$5=$AD$10,$E$5=$AD$11,$E$5=$AD$12),ROUND(((34-(($L$7-32)/1.8))*((IF(AZ19<0.05,0.05,AZ19)-0.05)^0.62)*((0.37*IF(AZ19<0.05,0.05,AZ19)*40)+3.14)),0)))","v":8},{"$f":"IF(T19<10,\"A\",IF(T19<20,\"B\",IF(T19<30,\"C\",\"keine\")))","v":"A"},{"$f":"ROUNDDOWN(IF(BU19<15,15,BU19),1)","v":27.7},{"$f":"+ROUND(G19*M19,0)","v":1943},{"$f":"IF(OR($E$5=$AD$5,$E$5=$AD$6,$E$5=$AD$7,$E$5=$AD$8),\"m³/h\",IF(OR($E$5=$AD$9,$E$5=$AD$10,$E$5=$AD$11,$E$5=$AD$12),\"cfm\",\"\"))","v":"cfm"},{"$f":"ROUNDDOWN(10*LOG(L19*10^(0.1*V19))-$L$9,1)","v":34.5},null,null,null,{"$f":"IF(OR($E$5=$AD$5,$E$5=$AD$6,$E$5=$AD$7,$E$5=$AD$8),LEFT(K19,4)/1,ROUNDUP(LEFT(K19,5)/0.039,1))","v":1000},{"$f":"IF(OR($E$5=$AD$5,$E$5=$AD$6,$E$5=$AD$7,$E$5=$AD$8),+(LN(G19)-LN(16.849))/0.0377,IF(OR($E$5=$AD$9,$E$5=$AD$10,$E$5=$AD$11,$E$5=$AD$12),+(LN(G19/0.5875)-LN(16.849))/0.0377))","v":27.769488144605916},{"$f":"0.5204*EXP(0.0375*$AD$19)","v":1.4743220736875162},{"$f":"+AE19+(AH19-AE19)/3","v":1.3698891291018795},{"$f":"+(AF19+AH19)/2","v":1.2654561845162429},{"$f":"0.4529*EXP(0.0339*$AD$19)","v":1.1610232399306062},{"$f":"+(AH19+AJ19)/2","v":1.0630891822724078},{"$f":"+(AH19+AL19)/2","v":0.96515512461420938},{"$f":"+(AJ19+AL19)/2","v":0.86722106695601098},{"$f":"0.2023*EXP(0.0481*$AD$19)","v":0.76928700929781269},{"$f":"+(AL19+AN19)/2","v":0.67376593456597078},{"$f":"0.1603*EXP(0.0462*$AD$19)","v":0.57824485983412888},{"$f":"ROUND(HLOOKUP($AC$16,$AE$18:$AN$38,2,FALSE),1)","v":1.3},{"$f":"0.0086*($AD$19)^2-0.3286*$AD$19+14.029","v":11.535788653277809},{"$f":"AR19-(AR19-AP19)/2","v":11.91804889541865},{"$f":"AS19-(AS19-AP19)/3","v":12.30030913755949},{"$f":"0.0143*($AD$19)^2-0.6143*$AD$19+18.714","v":12.682569379700329},{"$f":"AU19-(AU19-AS19)/2","v":13.261927034775248},{"$f":"AV19-(AV19-AS19)/3","v":13.841284689850164},{"$f":"AW19-(AW19-AS19)/4","v":14.420642344925081},{"$f":"15","v":15},{"$f":"AY19-(AY19-AW19)/2","v":16},{"$f":"17","v":17},{"$f":"ROUND(HLOOKUP($AC$16,$AP$18:$AY$38,2,FALSE)/100,2)","v":0.12},{"$f":"IF(AC19<=$BB$18,BB19,IF(AND(AC19>$BB$18,AC19<=$BC$18),BC19,IF(AND(AC19>$BC$18,AC19<=$BD$18),BD19,IF(AND(AC19>$BD$18,AC19<=$BE$18),BE19,IF(AND(AC19>$BE$18,AC19<=$BF$18),BF19,IF(AC21>$BF$18,BF19))))))","v":1},1,1,1,2,2,null,null,{"$f":"IF(AC19<=$BJ$18,BJ19,IF(AND(AC19>$BJ$18,AC19<=$BK$18),BK19,IF(AND(AC19>$BK$18,AC19<=$BL$18),BL19,IF(AND(AC19>$BL$18,AC19<=$BM$18),BM19,IF(AND(AC19>$BM$18,AC19<=$BN$18),BN19,IF(AC19>$BN$18,BN19))))))","v":100},100,100,100,100,100,null,null,{"$f":"IF(OR($E$5=$AD$5,$E$5=$AD$6,$E$5=$AD$7,$E$5=$AD$8),G19,IF(OR($E$5=$AD$9,$E$5=$AD$10,$E$5=$AD$11,$E$5=$AD$12),G19/0.5875))","v":48},{"$f":"+IF(AD19<0,0,AD19)","v":27.769488144605916},null,null,{"$f":"10*LOG((AC19/1000)*10^(0.1*BR19))","v":27.769488144605923},"LDB small/1","SDA","-",{"$f":"IF(OR($E$5=$AD$5,$E$5=$AD$6,$E$5=$AD$7,$E$5=$AD$8),G19*(AC19/1000),((G19*0.5875)*(AC19/1000))*0.5875)","v":9.7334062500000016}]
[]
[null,null,null,null,{"$f":"IF($E$4=$AC$3,Legende!A22,IF($E$4=$AC$4,Legende!B22,IF($E$4=$AC$5,Legende!C22,IF($E$4=$AC$6,Legende!D22))))","v":"LDB 12 clean"},{"$f":"IF($E$4=$AC$3,Legende!A26,IF($E$4=$AC$4,Legende!B26,IF($E$4=$AC$5,Legende!C26,IF($E$4=$AC$6,Legende!D26))))","v":"1-slot"},41.125,{"$f":"IF(OR($E$5=$AD$5,$E$5=$AD$6,$E$5=$AD$7,$E$5=$AD$8),\"m³/(h*m)\",IF(OR($E$5=$AD$9,$E$5=$AD$10,$E$5=$AD$11,$E$5=$AD$12),\"cfm/ft\",\"\"))","v":"cfm/ft"},{"$f":"IF(OR($E$5=$AD$5,$E$5=$AD$6,$E$5=$AD$7,$E$5=$AD$8),70,IF(OR($E$5=$AD$9,$E$5=$AD$10,$E$5=$AD$11,$E$5=$AD$12),70*0.5875,\"\"))","v":41.125},{"$f":"IF(OR($E$5=$AD$5,$E$5=$AD$6,$E$5=$AD$7,$E$5=$AD$8),\"m³/(h*m)\",IF(OR($E$5=$AD$9,$E$5=$AD$10,$E$5=$AD$11,$E$5=$AD$12),\"cfm\",\"\"))","v":"cfm"},"39,00 in",{"$f":"IF((ROUNDUP($L$6/(G21*AC21/1000),0))=0,1,ROUNDUP($L$6/(G21*AC21/1000),0))","v":15},{"$f":"IF(OR($E$5=$AD$5,$E$5=$AD$6,$E$5=$AD$7,$E$5=$AD$8),AC21*L21/1000,IF(OR($E$5=$AD$9,$E$5=$AD$10,$E$5=$AD$11,$E$5=$AD$12),AC21*L21/1000*3.28084))","v":49.212600000000002},{"$f":"IF(OR($E$5=$AD$5,$E$5=$AD$6,$E$5=$AD$7,$E$5=$AD$8),\"m\",IF(OR($E$5=$AD$9,$E$5=$AD$10,$E$5=$AD$11,$E$5=$AD$12),\"ft\",\"\"))","v":"ft"},{"$f":"ROUND(1.8488*EXP(0.0699*AD21),0)","v":8},{"$f":"IF(OR($E$5=$AD$5,$E$5=$AD$6,$E$5=$AD$7,$E$5=$AD$8),AO21,IF(OR($E$5=$AD$9,$E$5=$AD$10,$E$5=$AD$11,$E$5=$AD$12),AO21*3.28084))","v":5.9055119999999999},{"$f":"IF(OR($E$5=$AD$5,$E$5=$AD$6,$E$5=$AD$7,$E$5=$AD$8),\"m\",IF(OR($E$5=$AD$9,$E$5=$AD$10,$E$5=$AD$11,$E$5=$AD$12),\"ft\",\"\"))","v":"ft"},{"$f":"IF(OR($E$5=$AD$5,$E$5=$AD$6,$E$5=$AD$7,$E$5=$AD$8),AZ21,IF(OR($E$5=$AD$9,$E$5=$AD$10,$E$5=$AD$11,$E$5=$AD$12),AZ21*3.28084))","v":0.49212599999999995},{"$f":"IF(OR($E$5=$AD$5,$E$5=$AD$6,$E$5=$AD$7,$E$5=$AD$8),\"m/s\",IF(OR($E$5=$AD$9,$E$5=$AD$10,$E$5=$AD$11,$E$5=$AD$12),\"ft/s\",\"\"))","v":"ft/s"},{"$f":"IF(OR($E$5=$AD$5,$E$5=$AD$6,$E$5=$AD$7,$E$5=$AD$8),ROUND(((34-$L$7)*((IF(AZ21<0.05,0.05,AZ21)-0.05)^0.62)*((0.37*IF(AZ21<0.05,0.05,AZ21)*40)+3.14)),0),IF(OR($E$5=$AD$9,$E$5=$AD$10,$E$5=$AD$11,$E$5=$AD$12),ROUND(((34-(($L$7-32)/1.8))*((IF(AZ21<0.05,0.05,AZ21)-0.05)^0.62)*((0.37*IF(AZ21<0.05,0.05,AZ21)*40)+3.14)),0)))","v":10},{"$f":"IF(T21<10,\"A\",IF(T21<20,\"B\",IF(T21<30,\"C\",\"keine\")))","v":"B"},{"$f":"ROUNDDOWN(IF(BU21<15,15,BU21),1)","v":27.1},{"$f":"+ROUND(G21*M21,0)","v":2024},{"$f":"IF(OR($E$5=$AD$5,$E$5=$AD$6,$E$5=$AD$7,$E$5=$AD$8),\"m³/h\",IF(OR($E$5=$AD$9,$E$5=$AD$10,$E$5=$AD$11,$E$5=$AD$12),\"cfm\",\"\"))","v":"cfm"},{"$f":"ROUNDDOWN(10*LOG(L21*10^(0.1*V21))-$L$9,1)","v":32.4},null,null,null,{"$f":"IF(OR($E$5=$AD$5,$E$5=$AD$6,$E$5=$AD$7,$E$5=$AD$8),LEFT(K21,4)/1,ROUNDUP(LEFT(K21,5)/0.039,1))","v":1000},{"$f":"IF(OR($E$5=$AD$5,$E$5=$AD$6,$E$5=$AD$7,$E$5=$AD$8),+(LN(G21)-LN(32.525))/0.0357,IF(OR($E$5=$AD$9,$E$5=$AD$10,$E$5=$AD$11,$E$5=$AD$12),+(LN(G21/0.5875)-LN(32.525))/0.0357))","v":21.470202175092162},{"$f":"1.0132*EXP(0.0339*$AD$21)","v":2.0979349271478713},{"$f":"+AE21+(AH21-AE21)/3","v":1.9588130277616362},{"$f":"+(AF21+AH21)/2","v":1.8196911283754011},{"$f":"0.7961*EXP(0.0348*$AD$21)","v":1.6805692289891658},{"$f":"+(AH21+AJ21)/2","v":1.5611376931514562},{"$f":"+(AH21+AL21)/2","v":1.4417061573137464},{"$f":"+(AJ21+AL21)/2","v":1.3222746214760366},{"$f":"0.514*EXP(0.0396*$AD$21)","v":1.2028430856383268},{"$f":"+(AL21+AN21)/2","v":1.0617266063093092},{"$f":"0.3564*EXP(0.0442*$AD$21)","v":0.92061012698029143},{"$f":"ROUND(HLOOKUP($AC$16,$AE$18:$AN$38,4,FALSE),1)","v":1.8},{"$f":"10.213*EXP(0.0127*$AD$21)","v":13.414456734919089},{"$f":"AR21-(AR21-AP21)/2","v":14.030047557724382},{"$f":"AS21-(AS21-AP21)/3","v":14.645638380529675},{"$f":"11.644*EXP(0.0126*$AD$21)","v":15.261229203334969},{"$f":"AU21-(AU21-AS21)/2","v":15.445530505028348},{"$f":"AV21-(AV21-AS21)/3","v":15.629831806721729},{"$f":"AW21-(AW21-AS21)/4","v":15.814133108415108},{"$f":"12.259*EXP(0.0124*$AD$21)","v":15.998434410108487},{"$f":"AY21-(AY21-AW21)/2","v":16.826217762182161},{"$f":"0.0071*($AD$21)^2-0.2271*$AD$21+19.257","v":17.654001114255831},{"$f":"ROUND(HLOOKUP($AC$16,$AP$18:$AY$38,4,FALSE)/100,2)","v":0.15},{"$f":"IF(AC21<=$BB$18,BB21,IF(AND(AC21>$BB$18,AC21<=$BC$18),BC21,IF(AND(AC21>$BC$18,AC21<=$BD$18),BD21,IF(AND(AC21>$BD$18,AC21<=$BE$18),BE21,IF(AND(AC21>$BE$18,AC21<=$BF$18),BF21,IF(AND(AC21>$BF$18,AC21<=$BG$18),BG21,IF(AND(AC21>$BG$18,AC21<=$BH$18),BH21,IF(AC21>$BH$18,BH21))))))))","v":1},1,1,1,1,1,2,2,{"$f":"IF(AC21<=$BJ$18,BJ21,IF(AND(AC21>$BJ$18,AC21<=$BK$18),BK21,IF(AND(AC21>$BK$18,AC21<=$BL$18),BL21,IF(AND(AC21>$BL$18,AC21<=$BM$18),BM21,IF(AND(AC21>$BM$18,AC21<=$BN$18),BN21,IF(AND(AC21>$BN$18,AC21<=$BO$18),BO21,IF(AND(AC21>$BO$18,AC21<=$BP$18),BP21,IF(AC21>$BP$18,BP21))))))))","v":100},80,80,100,125,125,80,100,{"$f":"IF(OR($E$5=$AD$5,$E$5=$AD$6,$E$5=$AD$7,$E$5=$AD$8),G21,IF(OR($E$5=$AD$9,$E$5=$AD$10,$E$5=$AD$11,$E$5=$AD$12),G21/0.5875))","v":70},{"$f":"+IF(AD21<0,0,AD21)","v":21.470202175092162},{"$f":" (-0.0022355889*(BI21)^2 + 0.4201809847*BI21 + 5.399628589)*LN((BQ21*(AC21/1000))/BA21)+(-0.0000029509*(BI21)^3 + 0.0099403371*(BI21)^2 - 1.9777335627*BI21+ 21.5271635053)+10*LOG(BA21)","v":26.681377985973043},{"$f":" 73.7573595264*LOG(BQ21)-119.2146207935+10*LOG(AC21/1000)","v":16.874938705287505},{"$f":"10*LOG(10^(0.1*BS21)+10^(0.1*BT21))","v":27.113262109087305},"LDB clean/1","DLU","0°",{"$f":"IF(OR($E$5=$AD$5,$E$5=$AD$6,$E$5=$AD$7,$E$5=$AD$8),G21*(AC21/1000),((G21*0.5875)*(AC21/1000))*0.5875)","v":14.194550781249999}]
[null,null,"X",null,{"$f":"IF($E$4=$AC$3,Legende!A22,IF($E$4=$AC$4,Legende!B22,IF($E$4=$AC$5,Legende!C22,IF($E$4=$AC$6,Legende!D22))))","v":"LDB 12 clean"},{"$f":"IF($E$4=$AC$3,Legende!A27,IF($E$4=$AC$4,Legende!B27,IF($E$4=$AC$5,Legende!C27,IF($E$4=$AC$6,Legende!D27))))","v":"2-slot"},76.375,{"$f":"IF(OR($E$5=$AD$5,$E$5=$AD$6,$E$5=$AD$7,$E$5=$AD$8),\"m³/(h*m)\",IF(OR($E$5=$AD$9,$E$5=$AD$10,$E$5=$AD$11,$E$5=$AD$12),\"cfm/ft\",\"\"))","v":"cfm/ft"},{"$f":"IF(OR($E$5=$AD$5,$E$5=$AD$6,$E$5=$AD$7,$E$5=$AD$8),130,IF(OR($E$5=$AD$9,$E$5=$AD$10,$E$5=$AD$11,$E$5=$AD$12),130*0.5875,\"\"))","v":76.375},{"$f":"IF(OR($E$5=$AD$5,$E$5=$AD$6,$E$5=$AD$7,$E$5=$AD$8),\"m³/(h*m)\",IF(OR($E$5=$AD$9,$E$5=$AD$10,$E$5=$AD$11,$E$5=$AD$12),\"cfm\",\"\"))","v":"cfm"},"39,00 in",{"$f":"IF((ROUNDUP($L$6/(G22*AC22/1000),0))=0,1,ROUNDUP($L$6/(G22*AC22/1000),0))","v":8},{"$f":"IF(OR($E$5=$AD$5,$E$5=$AD$6,$E$5=$AD$7,$E$5=$AD$8),AC22*L22/1000,IF(OR($E$5=$AD$9,$E$5=$AD$10,$E$5=$AD$11,$E$5=$AD$12),AC22*L22/1000*3.28084))","v":26.24672},{"$f":"IF(OR($E$5=$AD$5,$E$5=$AD$6,$E$5=$AD$7,$E$5=$AD$8),\"m\",IF(OR($E$5=$AD$9,$E$5=$AD$10,$E$5=$AD$11,$E$5=$AD$12),\"ft\",\"\"))","v":"ft"},{"$f":"ROUND(1.6218*EXP(0.0609*AD22),0)","v":8},{"$f":"IF(OR($E$5=$AD$5,$E$5=$AD$6,$E$5=$AD$7,$E$5=$AD$8),AO22,IF(OR($E$5=$AD$9,$E$5=$AD$10,$E$5=$AD$11,$E$5=$AD$12),AO22*3.28084))","v":7.5459319999999996},{"$f":"IF(OR($E$5=$AD$5,$E$5=$AD$6,$E$5=$AD$7,$E$5=$AD$8),\"m\",IF(OR($E$5=$AD$9,$E$5=$AD$10,$E$5=$AD$11,$E$5=$AD$12),\"ft\",\"\"))","v":"ft"},{"$f":"IF(OR($E$5=$AD$5,$E$5=$AD$6,$E$5=$AD$7,$E$5=$AD$8),AZ22,IF(OR($E$5=$AD$9,$E$5=$AD$10,$E$5=$AD$11,$E$5=$AD$12),AZ22*3.28084))","v":0.59055119999999994},{"$f":"IF(OR($E$5=$AD$5,$E$5=$AD$6,$E$5=$AD$7,$E$5=$AD$8),\"m/s\",IF(OR($E$5=$AD$9,$E$5=$AD$10,$E$5=$AD$11,$E$5=$AD$12),\"ft/s\",\"\"))","v":"ft/s"},{"$f":"IF(OR($E$5=$AD$5,$E$5=$AD$6,$E$5=$AD$7,$E$5=$AD$8),ROUND(((34-$L$7)*((IF(AZ22<0.05,0.05,AZ22)-0.05)^0.62)*((0.37*IF(AZ22<0.05,0.05,AZ22)*40)+3.14)),0),IF(OR($E$5=$AD$9,$E$5=$AD$10,$E$5=$AD$11,$E$5=$AD$12),ROUND(((34-(($L$7-32)/1.8))*((IF(AZ22<0.05,0.05,AZ22)-0.05)^0.62)*((0.37*IF(AZ22<0.05,0.05,AZ22)*40)+3.14)),0)))","v":13},{"$f":"IF(T22<10,\"A\",IF(T22<20,\"B\",IF(T22<30,\"C\",\"keine\")))","v":"B"},{"$f":"ROUNDDOWN(IF(BU22<15,15,BU22),1)","v":27.3},2005,"cfm",{"$f":"ROUNDDOWN(10*LOG(L22*10^(0.1*V22))-$L$9,1)","v":29.9},null,null,null,1000,{"$f":"IF(OR($E$5=$AD$5,$E$5=$AD$6,$E$5=$AD$7,$E$5=$AD$8),+(LN(G22)-LN(54.787))/0.0326,IF(OR($E$5=$AD$9,$E$5=$AD$10,$E$5=$AD$11,$E$5=$AD$12),+(LN(G22/0.5875)-LN(54.787))/0.0326))","v":26.50556781968065},{"$f":"1.1648*EXP(0.0309*$AD$22)","v":2.6420931004053698},{"$f":"+AE22+(AH22-AE22)/3","v":2.4869867030560098},{"$f":"+(AF22+AH22)/2","v":2.3318803057066493},{"$f":"0.9247*EXP(0.0323*$AD$22)","v":2.1767739083572892},{"$f":"+(AH22+AJ22)/2","v":2.051064145825797},{"$f":"+(AH22+AL22)/2","v":1.9253543832943047},{"$f":"+(AJ22+AL22)/2","v":1.7996446207628125},{"$f":"0.655*EXP(0.0354*$AD$22)","v":1.6739348582313203},{"$f":"+(AL22+AN22)/2","v":1.5158491285589184},{"$f":"0.4728*EXP(0.0398*$AD$22)","v":1.3577633988865165},{"$f":"ROUND(HLOOKUP($AC$16,$AE$18:$AN$38,5,FALSE),1)","v":2.2999999999999998},{"$f":"11.644*EXP(0.0126*$AD$22)","v":16.260863043406221},{"$f":"AR22-(AR22-AP22)/2","v":17.101334457417828},{"$f":"AS22-(AS22-AP22)/3","v":17.94180587142943},{"$f":"13.343*EXP(0.0129*$AD$22)","v":18.782277285441033},{"$f":"AU22-(AU22-AS22)/2","v":19.146256995288915},{"$f":"AV22-(AV22-AS22)/3","v":19.510236705136794},{"$f":"AW22-(AW22-AS22)/4","v":19.874216414984673},{"$f":"15.526*EXP(0.01*$AD$22)","v":20.238196124832555},{"$f":"AY22-(AY22-AW22)/2","v":20.354772610564591},{"$f":"0.0129*$AD$22^2-0.4729*$AD$22+23.943","v":20.471349096296628},{"$f":"ROUND(HLOOKUP($AC$16,$AP$18:$AY$38,5,FALSE)/100,2)","v":0.18},{"$f":"IF(AC22<=$BB$18,BB22,IF(AND(AC22>$BB$18,AC22<=$BC$18),BC22,IF(AND(AC22>$BC$18,AC22<=$BD$18),BD22,IF(AND(AC22>$BD$18,AC22<=$BE$18),BE22,IF(AND(AC22>$BE$18,AC22<=$BF$18),BF22,IF(AND(AC22>$BF$18,AC22<=$BG$18),BG22,IF(AND(AC22>$BG$18,AC22<=$BH$18),BH22,IF(AC22>$BH$18,BH22))))))))","v":1},1,1,1,1,2,2,2,{"$f":"IF(AC22<=$BJ$18,BJ22,IF(AND(AC22>$BJ$18,AC22<=$BK$18),BK22,IF(AND(AC22>$BK$18,AC22<=$BL$18),BL22,IF(AND(AC22>$BL$18,AC22<=$BM$18),BM22,IF(AND(AC22>$BM$18,AC22<=$BN$18),BN22,IF(AND(AC22>$BN$18,AC22<=$BO$18),BO22,IF(AND(AC22>$BO$18,AC22<=$BP$18),BP22,IF(AC22>$BP$18,BP22))))))))","v":125},80,100,125,140,100,100,125,{"$f":"IF(OR($E$5=$AD$5,$E$5=$AD$6,$E$5=$AD$7,$E$5=$AD$8),G22,IF(OR($E$5=$AD$9,$E$5=$AD$10,$E$5=$AD$11,$E$5=$AD$12),G22/0.5875))","v":130},{"$f":"+IF(AD22<0,0,AD22)","v":26.50556781968065},{"$f":" (0.000000036775*BI22^4 - 0.000097789296*BI22^3 + 0.031851098925*BI22^2 - 3.518164042311*BI22 + 153.06267686179)*LN((BQ22*(AC22/1000))/BA22)+(-0.000001589267*BI22^4 + 0.001198286334*BI22^3 - 0.287868077763*BI22^2 + 27.229051331336*BI22- 974.551194289673)","v":24.450825151756561},{"$f":" 53.6850931947*LOG(BQ22)  -89.3138537125+10*LOG(AC22/1000)","v":24.17339216440908},{"$f":"10*LOG(10^(0.1*BS22)+10^(0.1*BT22))","v":27.324623585838438},"LDB clean/2","DLU","0°",{"$f":"IF(OR($E$5=$AD$5,$E$5=$AD$6,$E$5=$AD$7,$E$5=$AD$8),G22*(AC22/1000),((G22*0.5875)*(AC22/1000))*0.5875)","v":26.361308593750003}]
[null,null,null,null,{"$f":"IF($E$4=$AC$3,Legende!A22,IF($E$4=$AC$4,Legende!B22,IF($E$4=$AC$5,Legende!C22,IF($E$4=$AC$6,Legende!D22))))","v":"LDB 12 clean"},{"$f":"IF($E$4=$AC$3,Legende!A28,IF($E$4=$AC$4,Legende!B28,IF($E$4=$AC$5,Legende!C28,IF($E$4=$AC$6,Legende!D28))))","v":"3-slot"},111.625,{"$f":"IF(OR($E$5=$AD$5,$E$5=$AD$6,$E$5=$AD$7,$E$5=$AD$8),\"m³/(h*m)\",IF(OR($E$5=$AD$9,$E$5=$AD$10,$E$5=$AD$11,$E$5=$AD$12),\"cfm/ft\",\"\"))","v":"cfm/ft"},{"$f":"IF(OR($E$5=$AD$5,$E$5=$AD$6,$E$5=$AD$7,$E$5=$AD$8),190,IF(OR($E$5=$AD$9,$E$5=$AD$10,$E$5=$AD$11,$E$5=$AD$12),190*0.5875,\"\"))","v":111.625},{"$f":"IF(OR($E$5=$AD$5,$E$5=$AD$6,$E$5=$AD$7,$E$5=$AD$8),\"m³/(h*m)\",IF(OR($E$5=$AD$9,$E$5=$AD$10,$E$5=$AD$11,$E$5=$AD$12),\"cfm\",\"\"))","v":"cfm"},"39,00 in",{"$f":"IF((ROUNDUP($L$6/(G23*AC23/1000),0))=0,1,ROUNDUP($L$6/(G23*AC23/1000),0))","v":6},{"$f":"IF(OR($E$5=$AD$5,$E$5=$AD$6,$E$5=$AD$7,$E$5=$AD$8),AC23*L23/1000,IF(OR($E$5=$AD$9,$E$5=$AD$10,$E$5=$AD$11,$E$5=$AD$12),AC23*L23/1000*3.28084))","v":19.685040000000001},{"$f":"IF(OR($E$5=$AD$5,$E$5=$AD$6,$E$5=$AD$7,$E$5=$AD$8),\"m\",IF(OR($E$5=$AD$9,$E$5=$AD$10,$E$5=$AD$11,$E$5=$AD$12),\"ft\",\"\"))","v":"ft"},{"$f":"ROUND(1.6778*EXP(0.0637*AD23),0)","v":8},{"$f":"IF(OR($E$5=$AD$5,$E$5=$AD$6,$E$5=$AD$7,$E$5=$AD$8),AO23,IF(OR($E$5=$AD$9,$E$5=$AD$10,$E$5=$AD$11,$E$5=$AD$12),AO23*3.28084))","v":5.2493440000000007},{"$f":"IF(OR($E$5=$AD$5,$E$5=$AD$6,$E$5=$AD$7,$E$5=$AD$8),\"m\",IF(OR($E$5=$AD$9,$E$5=$AD$10,$E$5=$AD$11,$E$5=$AD$12),\"ft\",\"\"))","v":"ft"},{"$f":"IF(OR($E$5=$AD$5,$E$5=$AD$6,$E$5=$AD$7,$E$5=$AD$8),AZ23,IF(OR($E$5=$AD$9,$E$5=$AD$10,$E$5=$AD$11,$E$5=$AD$12),AZ23*3.28084))","v":0.55774279999999998},{"$f":"IF(OR($E$5=$AD$5,$E$5=$AD$6,$E$5=$AD$7,$E$5=$AD$8),\"m/s\",IF(OR($E$5=$AD$9,$E$5=$AD$10,$E$5=$AD$11,$E$5=$AD$12),\"ft/s\",\"\"))","v":"ft/s"},{"$f":"IF(OR($E$5=$AD$5,$E$5=$AD$6,$E$5=$AD$7,$E$5=$AD$8),ROUND(((34-$L$7)*((IF(AZ23<0.05,0.05,AZ23)-0.05)^0.62)*((0.37*IF(AZ23<0.05,0.05,AZ23)*40)+3.14)),0),IF(OR($E$5=$AD$9,$E$5=$AD$10,$E$5=$AD$11,$E$5=$AD$12),ROUND(((34-(($L$7-32)/1.8))*((IF(AZ23<0.05,0.05,AZ23)-0.05)^0.62)*((0.37*IF(AZ23<0.05,0.05,AZ23)*40)+3.14)),0)))","v":12},{"$f":"IF(T23<10,\"A\",IF(T23<20,\"B\",IF(T23<30,\"C\",\"keine\")))","v":"B"},{"$f":"ROUNDDOWN(IF(BU23<15,15,BU23),1)","v":31.2},2197,"cfm",{"$f":"ROUNDDOWN(10*LOG(L23*10^(0.1*V23))-$L$9,1)","v":32.5},null,null,null,1000,{"$f":"IF(OR($E$5=$AD$5,$E$5=$AD$6,$E$5=$AD$7,$E$5=$AD$8),+(LN(G23)-LN(86.228))/0.0323,IF(OR($E$5=$AD$9,$E$5=$AD$10,$E$5=$AD$11,$E$5=$AD$12),+(LN(G23/0.5875)-LN(86.228))/0.0323))","v":24.459105921030933},{"$f":"0.8069*EXP(0.034*$AD$23)","v":1.8534598231886144},{"$f":"+AE23+(AH23-AE23)/3","v":1.7446392790733702},{"$f":"+(AF23+AH23)/2","v":1.6358187349581261},{"$f":"0.693*EXP(0.0323*$AD$23)","v":1.526998190842882},{"$f":"+(AH23+AJ23)/2","v":1.4617876714113889},{"$f":"+(AH23+AL23)/2","v":1.3965771519798955},{"$f":"+(AJ23+AL23)/2","v":1.3313666325484022},{"$f":"0.4842*EXP(0.0393*$AD$23)","v":1.266156113116909},{"$f":"+(AL23+AN23)/2","v":1.1504011278190363},{"$f":"0.3947*EXP(0.0394*$AD$23)","v":1.0346461425211637},{"$f":"ROUND(HLOOKUP($AC$16,$AE$18:$AN$38,6,FALSE),1)","v":1.6},{"$f":"15.159*EXP(0.0091*$AD$23)","v":18.938033961507113},{"$f":"AR23-(AR23-AP23)/2","v":18.20874123735225},{"$f":"AS23-(AS23-AP23)/3","v":17.479448513197383},{"$f":"0.01*($AD$23)^2-0.31*$AD$23+18.35","v":16.750155789042516},{"$f":"AU23-(AU23-AS23)/2","v":17.066421558672218},{"$f":"AV23-(AV23-AS23)/3","v":17.382687328301916},{"$f":"AW23-(AW23-AS23)/4","v":17.698953097931614},{"$f":"0.02*$AD$23^2-0.74*$AD$23+24.15","v":18.015218867561316},{"$f":"AY23-(AY23-AW23)/2","v":18.811854630720081},{"$f":"0.02*($AD$23)^2-0.82*$AD$23+27.7","v":19.608490393878846},{"$f":"ROUND(HLOOKUP($AC$16,$AP$18:$AY$38,6,FALSE)/100,2)","v":0.17},{"$f":"IF(AC23<=$BB$18,BB23,IF(AND(AC23>$BB$18,AC23<=$BC$18),BC23,IF(AND(AC23>$BC$18,AC23<=$BD$18),BD23,IF(AND(AC23>$BD$18,AC23<=$BE$18),BE23,IF(AND(AC23>$BE$18,AC23<=$BF$18),BF23,IF(AND(AC23>$BF$18,AC23<=$BG$18),BG23,IF(AND(AC23>$BG$18,AC23<=$BH$18),BH23,IF(AC23>$BH$18,BH23))))))))","v":1},1,1,1,2,2,2,2,{"$f":"IF(AC23<=$BJ$18,BJ23,IF(AND(AC23>$BJ$18,AC23<=$BK$18),BK23,IF(AND(AC23>$BK$18,AC23<=$BL$18),BL23,IF(AND(AC23>$BL$18,AC23<=$BM$18),BM23,IF(AND(AC23>$BM$18,AC23<=$BN$18),BN23,IF(AND(AC23>$BN$18,AC23<=$BO$18),BO23,IF(AND(AC23>$BO$18,AC23<=$BP$18),BP23,IF(AC23>$BP$18,BP23))))))))","v":140},100,125,140,140,140,140,140,{"$f":"IF(OR($E$5=$AD$5,$E$5=$AD$6,$E$5=$AD$7,$E$5=$AD$8),G23,IF(OR($E$5=$AD$9,$E$5=$AD$10,$E$5=$AD$11,$E$5=$AD$12),G23/0.5875))","v":190},{"$f":"+IF(AD23<0,0,AD23)","v":24.459105921030933},{"$f":"(-0.000023788293*BI23^3 + 0.006551313626*BI23^2 - 0.573673222638*BI23 + 42.996345567831)*LN((BQ23*(AC23/1000))/BA23)+(0.000099312149*BI23^3 - 0.024864140926*BI23^2 + 1.505393168403*BI23 - 101.04319263046)+10*LOG(BA23)","v":30.327427474547477},{"$f":"57.5627700098*LOG(BQ23) -107.295103557+10*LOG(AC23/1000)","v":23.876265883651257},{"$f":"10*LOG(10^(0.1*BS23)+10^(0.1*BT23))","v":31.213762587858437},"LDB clean/3","DLU","0°",{"$f":"IF(OR($E$5=$AD$5,$E$5=$AD$6,$E$5=$AD$7,$E$5=$AD$8),G23*(AC23/1000),((G23*0.5875)*(AC23/1000))*0.5875)","v":38.528066406250005}]
[null,null,null,null,{"$f":"IF($E$4=$AC$3,Legende!A22,IF($E$4=$AC$4,Legende!B22,IF($E$4=$AC$5,Legende!C22,IF($E$4=$AC$6,Legende!D22))))","v":"LDB 12 clean"},{"$f":"IF($E$4=$AC$3,Legende!A29,IF($E$4=$AC$4,Legende!B29,IF($E$4=$AC$5,Legende!C29,IF($E$4=$AC$6,Legende!D29))))","v":"4-slot"},146.875,{"$f":"IF(OR($E$5=$AD$5,$E$5=$AD$6,$E$5=$AD$7,$E$5=$AD$8),\"m³/(h*m)\",IF(OR($E$5=$AD$9,$E$5=$AD$10,$E$5=$AD$11,$E$5=$AD$12),\"cfm/ft\",\"\"))","v":"cfm/ft"},{"$f":"IF(OR($E$5=$AD$5,$E$5=$AD$6,$E$5=$AD$7,$E$5=$AD$8),250,IF(OR($E$5=$AD$9,$E$5=$AD$10,$E$5=$AD$11,$E$5=$AD$12),250*0.5875,\"\"))","v":146.875},{"$f":"IF(OR($E$5=$AD$5,$E$5=$AD$6,$E$5=$AD$7,$E$5=$AD$8),\"m³/(h*m)\",IF(OR($E$5=$AD$9,$E$5=$AD$10,$E$5=$AD$11,$E$5=$AD$12),\"cfm\",\"\"))","v":"cfm"},"39,00 in",{"$f":"IF((ROUNDUP($L$6/(G24*AC24/1000),0))=0,1,ROUNDUP($L$6/(G24*AC24/1000),0))","v":4},{"$f":"IF(OR($E$5=$AD$5,$E$5=$AD$6,$E$5=$AD$7,$E$5=$AD$8),AC24*L24/1000,IF(OR($E$5=$AD$9,$E$5=$AD$10,$E$5=$AD$11,$E$5=$AD$12),AC24*L24/1000*3.28084))","v":13.12336},{"$f":"IF(OR($E$5=$AD$5,$E$5=$AD$6,$E$5=$AD$7,$E$5=$AD$8),\"m\",IF(OR($E$5=$AD$9,$E$5=$AD$10,$E$5=$AD$11,$E$5=$AD$12),\"ft\",\"\"))","v":"ft"},{"$f":"ROUND(1.6778*EXP(0.0637*AD25),0)","v":8},{"$f":"IF(OR($E$5=$AD$5,$E$5=$AD$6,$E$5=$AD$7,$E$5=$AD$8),AO24,IF(OR($E$5=$AD$9,$E$5=$AD$10,$E$5=$AD$11,$E$5=$AD$12),AO24*3.28084))","v":10.498688000000001},{"$f":"IF(OR($E$5=$AD$5,$E$5=$AD$6,$E$5=$AD$7,$E$5=$AD$8),\"m\",IF(OR($E$5=$AD$9,$E$5=$AD$10,$E$5=$AD$11,$E$5=$AD$12),\"ft\",\"\"))","v":"ft"},{"$f":"IF(OR($E$5=$AD$5,$E$5=$AD$6,$E$5=$AD$7,$E$5=$AD$8),AZ24,IF(OR($E$5=$AD$9,$E$5=$AD$10,$E$5=$AD$11,$E$5=$AD$12),AZ24*3.28084))","v":0.65616800000000008},{"$f":"IF(OR($E$5=$AD$5,$E$5=$AD$6,$E$5=$AD$7,$E$5=$AD$8),\"m/s\",IF(OR($E$5=$AD$9,$E$5=$AD$10,$E$5=$AD$11,$E$5=$AD$12),\"ft/s\",\"\"))","v":"ft/s"},{"$f":"IF(OR($E$5=$AD$5,$E$5=$AD$6,$E$5=$AD$7,$E$5=$AD$8),ROUND(((34-$L$7)*((IF(AZ24<0.05,0.05,AZ24)-0.05)^0.62)*((0.37*IF(AZ24<0.05,0.05,AZ24)*40)+3.14)),0),IF(OR($E$5=$AD$9,$E$5=$AD$10,$E$5=$AD$11,$E$5=$AD$12),ROUND(((34-(($L$7-32)/1.8))*((IF(AZ24<0.05,0.05,AZ24)-0.05)^0.62)*((0.37*IF(AZ24<0.05,0.05,AZ24)*40)+3.14)),0)))","v":15},{"$f":"IF(T24<10,\"A\",IF(T24<20,\"B\",IF(T24<30,\"C\",\"keine\")))","v":"B"},{"$f":"ROUNDDOWN(IF(BU24<15,15,BU24),1)","v":30},1927,"cfm",{"$f":"ROUNDDOWN(10*LOG(L24*10^(0.1*V24))-$L$9,1)","v":29.6},null,null,null,1000,{"$f":"IF(OR($E$5=$AD$5,$E$5=$AD$6,$E$5=$AD$7,$E$5=$AD$8),+(LN(G24)-LN(87.631))/0.0366,IF(OR($E$5=$AD$9,$E$5=$AD$10,$E$5=$AD$11,$E$5=$AD$12),+(LN(G24/0.5875)-LN(87.631))/0.0366))","v":28.642789651436416},{"$f":"0.5027*EXP(0.0724*$AD$24)","v":3.9987278077940269},{"$f":"+AE24+(AH24-AE24)/3","v":3.6041761177314919},{"$f":"+(AF24+AH24)/2","v":3.2096244276689569},{"$f":"0.3174*EXP(0.0762*$AD$24)","v":2.815072737606422},{"$f":"+(AH24+AJ24)/2","v":2.6300828607520095},{"$f":"+(AH24+AL24)/2","v":2.445092983897597},{"$f":"+(AJ24+AL24)/2","v":2.260103107043185},{"$f":"0.1882*EXP(0.0838*$AD$24)","v":2.0751132301887725},{"$f":"+(AL24+AN24)/2","v":1.8901233533343602},{"$f":"+AL24+AL24-AJ24","v":1.705133476479948},{"$f":"ROUND(HLOOKUP($AC$16,$AE$18:$AN$38,7,FALSE),1)","v":3.2},{"$f":"0.005*($AD$24)^2-0.105*$AD$24+15.525","v":16.619554081681343},{"$f":"AR24-(AR24-AP24)/2","v":18.087040039623282},{"$f":"AS24-(AS24-AP24)/3","v":19.554525997565225},{"$f":"0.0214*($AD$24)^2-0.6471*$AD$24+22","v":21.022011955507164},{"$f":"AU24-(AU24-AS24)/2","v":21.492781789909404},{"$f":"0.0229*($AD$24)^2-0.8143*$AD$24+26.5","v":21.963551624311645},{"$f":"+AU24+AU24-AT24","v":22.434321458713885},{"$f":"+AV24+AV24-AU24","v":22.905091293116126},{"$f":"+AW24+AW24-AV24","v":23.375861127518366},23.846630961920606,{"$f":"ROUND(HLOOKUP($AC$16,$AP$18:$AY$38,7,FALSE)/100,2)","v":0.2},{"$f":"IF(AC24<=$BB$18,BB24,IF(AND(AC24>$BB$18,AC24<=$BC$18),BC24,IF(AND(AC24>$BC$18,AC24<=$BD$18),BD24,IF(AND(AC24>$BD$18,AC24<=$BE$18),BE24,IF(AND(AC24>$BE$18,AC24<=$BF$18),BF24,IF(AND(AC24>$BF$18,AC24<=$BG$18),BG24,IF(AND(AC24>$BG$18,AC24<=$BH$18),BH24,IF(AC24>$BH$18,BH24))))))))","v":2},1,1,2,2,2,2,2,{"$f":"IF(AC24<=$BJ$18,BJ24,IF(AND(AC24>$BJ$18,AC24<=$BK$18),BK24,IF(AND(AC24>$BK$18,AC24<=$BL$18),BL24,IF(AND(AC24>$BL$18,AC24<=$BM$18),BM24,IF(AND(AC24>$BM$18,AC24<=$BN$18),BN24,IF(AND(AC24>$BN$18,AC24<=$BO$18),BO24,IF(AND(AC24>$BO$18,AC24<=$BP$18),BP24,IF(AC24>$BP$18,BP24))))))))","v":125},125,140,125,125,140,160,160,{"$f":"IF(OR($E$5=$AD$5,$E$5=$AD$6,$E$5=$AD$7,$E$5=$AD$8),G24,IF(OR($E$5=$AD$9,$E$5=$AD$10,$E$5=$AD$11,$E$5=$AD$12),G24/0.5875))","v":250},{"$f":"+IF(AD24<0,0,AD24)","v":28.642789651436416},{"$f":"(-0.000023788293*BI24^3 + 0.006551313626*BI24^2 - 0.573673222638*BI24 + 42.996345567831)*LN((BQ24*(AC24/1000))/BA24)+(0.000099312149*BI24^3 - 0.024864140926*BI24^2 + 1.505393168403*BI24 - 101.04319263046)+10*LOG(BA24)","v":26.88974198001381},{"$f":" 62.1456597122*LOG(BQ24) -121.8124227521+10*LOG(AC24/1000)","v":27.209141037102356},{"$f":"10*LOG(10^(0.1*BS24)+10^(0.1*BT24))","v":30.062677053242865},"LDB clean/4","DLU","0°",{"$f":"IF(OR($E$5=$AD$5,$E$5=$AD$6,$E$5=$AD$7,$E$5=$AD$8),G24*(AC24/1000),((G24*0.5875)*(AC24/1000))*0.5875)","v":50.69482421875}]
[null,null,null,null,null,null,null,null,null,null,null,null,null,null,null,null,null,null,null,null,null,null,null,null,null,null,null,null,null,{"$f":"IF(OR($E$5=$AD$5,$E$5=$AD$6,$E$5=$AD$7,$E$5=$AD$8),+(LN(G24/4*3)-LN(86.228))/0.0323,IF(OR($E$5=$AD$9,$E$5=$AD$10,$E$5=$AD$11,$E$5=$AD$12),+(LN(G24/4*3/0.5875)-LN(86.228))/0.0323))","v":24.049036981401802},"Keine Messergebnisse, Dezugswertformel vom 3-Schlitzigen / 4 * 3, Druckverlust ebenfalls 3-Schlitzige Fromel benutzt. Geschwindigkeit und Akustik Formeln vom classic 4-Schlitzigen übernommen"]
[null,null,null,null,{"$f":"IF($E$4=$AC$3,Legende!A23,IF($E$4=$AC$4,Legende!B23,IF($E$4=$AC$5,Legende!C23,IF($E$4=$AC$6,Legende!D23))))","v":"LDB 12 style"},{"$f":"IF($E$4=$AC$3,Legende!A26,IF($E$4=$AC$4,Legende!B26,IF($E$4=$AC$5,Legende!C26,IF($E$4=$AC$6,Legende!D26))))","v":"1-slot"},41.125,{"$f":"IF(OR($E$5=$AD$5,$E$5=$AD$6,$E$5=$AD$7,$E$5=$AD$8),\"m³/(h*m)\",IF(OR($E$5=$AD$9,$E$5=$AD$10,$E$5=$AD$11,$E$5=$AD$12),\"cfm/ft\",\"\"))","v":"cfm/ft"},{"$f":"IF(OR($E$5=$AD$5,$E$5=$AD$6,$E$5=$AD$7,$E$5=$AD$8),70,IF(OR($E$5=$AD$9,$E$5=$AD$10,$E$5=$AD$11,$E$5=$AD$12),70*0.5875,\"\"))","v":41.125},{"$f":"IF(OR($E$5=$AD$5,$E$5=$AD$6,$E$5=$AD$7,$E$5=$AD$8),\"m³/(h*m)\",IF(OR($E$5=$AD$9,$E$5=$AD$10,$E$5=$AD$11,$E$5=$AD$12),\"cfm\",\"\"))","v":"cfm"},"39,00 in",{"$f":"IF((ROUNDUP($L$6/(G26*AC26/1000),0))=0,1,ROUNDUP($L$6/(G26*AC26/1000),0))","v":15},{"$f":"IF(OR($E$5=$AD$5,$E$5=$AD$6,$E$5=$AD$7,$E$5=$AD$8),AC26*L26/1000,IF(OR($E$5=$AD$9,$E$5=$AD$10,$E$5=$AD$11,$E$5=$AD$12),AC26*L26/1000*3.28084))","v":49.212600000000002},{"$f":"IF(OR($E$5=$AD$5,$E$5=$AD$6,$E$5=$AD$7,$E$5=$AD$8),\"m\",IF(OR($E$5=$AD$9,$E$5=$AD$10,$E$5=$AD$11,$E$5=$AD$12),\"ft\",\"\"))","v":"ft"},{"$f":"ROUND(1.8488*EXP(0.0699*AD26),0)","v":8},{"$f":"IF(OR($E$5=$AD$5,$E$5=$AD$6,$E$5=$AD$7,$E$5=$AD$8),AO26,IF(OR($E$5=$AD$9,$E$5=$AD$10,$E$5=$AD$11,$E$5=$AD$12),AO26*3.28084))","v":5.9055119999999999},{"$f":"IF(OR($E$5=$AD$5,$E$5=$AD$6,$E$5=$AD$7,$E$5=$AD$8),\"m\",IF(OR($E$5=$AD$9,$E$5=$AD$10,$E$5=$AD$11,$E$5=$AD$12),\"ft\",\"\"))","v":"ft"},{"$f":"IF(OR($E$5=$AD$5,$E$5=$AD$6,$E$5=$AD$7,$E$5=$AD$8),AZ26,IF(OR($E$5=$AD$9,$E$5=$AD$10,$E$5=$AD$11,$E$5=$AD$12),AZ26*3.28084))","v":0.49212599999999995},{"$f":"IF(OR($E$5=$AD$5,$E$5=$AD$6,$E$5=$AD$7,$E$5=$AD$8),\"m/s\",IF(OR($E$5=$AD$9,$E$5=$AD$10,$E$5=$AD$11,$E$5=$AD$12),\"ft/s\",\"\"))","v":"ft/s"},{"$f":"IF(OR($E$5=$AD$5,$E$5=$AD$6,$E$5=$AD$7,$E$5=$AD$8),ROUND(((34-$L$7)*((IF(AZ26<0.05,0.05,AZ26)-0.05)^0.62)*((0.37*IF(AZ26<0.05,0.05,AZ26)*40)+3.14)),0),IF(OR($E$5=$AD$9,$E$5=$AD$10,$E$5=$AD$11,$E$5=$AD$12),ROUND(((34-(($L$7-32)/1.8))*((IF(AZ26<0.05,0.05,AZ26)-0.05)^0.62)*((0.37*IF(AZ26<0.05,0.05,AZ26)*40)+3.14)),0)))","v":10},{"$f":"IF(T26<10,\"A\",IF(T26<20,\"B\",IF(T26<30,\"C\",\"keine\")))","v":"B"},{"$f":"ROUNDDOWN(IF(BU26<15,15,BU26),1)","v":27.1},2024,"cfm",{"$f":"ROUNDDOWN(10*LOG(L26*10^(0.1*V26))-$L$9,1)","v":32.4},null,null,null,1000,{"$f":"IF(OR($E$5=$AD$5,$E$5=$AD$6,$E$5=$AD$7,$E$5=$AD$8),+(LN(G26)-LN(32.525))/0.0357,IF(OR($E$5=$AD$9,$E$5=$AD$10,$E$5=$AD$11,$E$5=$AD$12),+(LN(G26/0.5875)-LN(32.525))/0.0357))","v":21.470202175092162},{"$f":"1.0132*EXP(0.0339*$AD$26)","v":2.0979349271478713},{"$f":"+AE26+(AH26-AE26)/3","v":1.9588130277616362},{"$f":"+(AF26+AH26)/2","v":1.8196911283754011},{"$f":"0.7961*EXP(0.0348*$AD$26)","v":1.6805692289891658},{"$f":"+(AH26+AJ26)/2","v":1.5611376931514562},{"$f":"+(AH26+AL26)/2","v":1.4417061573137464},{"$f":"+(AJ26+AL26)/2","v":1.3222746214760366},{"$f":"0.514*EXP(0.0396*$AD$26)","v":1.2028430856383268},{"$f":"+(AL26+AN26)/2","v":1.0617266063093092},{"$f":"0.3564*EXP(0.0442*$AD$26)","v":0.92061012698029143},{"$f":"ROUND(HLOOKUP($AC$16,$AE$18:$AN$38,9,FALSE),1)","v":1.8},{"$f":"10.213*EXP(0.0127*$AD$26)","v":13.414456734919089},{"$f":"AR26-(AR26-AP26)/2","v":14.030047557724382},{"$f":"AS26-(AS26-AP26)/3","v":14.645638380529675},{"$f":"11.644*EXP(0.0126*$AD$26)","v":15.261229203334969},{"$f":"AU26-(AU26-AS26)/2","v":15.445530505028348},{"$f":"AV26-(AV26-AS26)/3","v":15.629831806721729},{"$f":"AW26-(AW26-AS26)/4","v":15.814133108415108},{"$f":"12.259*EXP(0.0124*$AD$26)","v":15.998434410108487},{"$f":"AY26-(AY26-AW26)/2","v":16.826217762182161},{"$f":"0.0071*($AD$26)^2-0.2271*$AD$26+19.257","v":17.654001114255831},{"$f":"ROUND(HLOOKUP($AC$16,$AP$18:$AY$38,9,FALSE)/100,2)","v":0.15},{"$f":"IF(AC26<=$BB$18,BB26,IF(AND(AC26>$BB$18,AC26<=$BC$18),BC26,IF(AND(AC26>$BC$18,AC26<=$BD$18),BD26,IF(AND(AC26>$BD$18,AC26<=$BE$18),BE26,IF(AND(AC26>$BE$18,AC26<=$BF$18),BF26,IF(AND(AC26>$BF$18,AC26<=$BG$18),BG26,IF(AND(AC26>$BG$18,AC26<=$BH$18),BH26,IF(AC26>$BH$18,BH26))))))))","v":1},1,1,1,1,1,2,2,{"$f":"IF(AC26<=$BJ$18,BJ26,IF(AND(AC26>$BJ$18,AC26<=$BK$18),BK26,IF(AND(AC26>$BK$18,AC26<=$BL$18),BL26,IF(AND(AC26>$BL$18,AC26<=$BM$18),BM26,IF(AND(AC26>$BM$18,AC26<=$BN$18),BN26,IF(AND(AC26>$BN$18,AC26<=$BO$18),BO26,IF(AND(AC26>$BO$18,AC26<=$BP$18),BP26,IF(AC26>$BP$18,BP26))))))))","v":100},80,80,100,125,125,80,100,{"$f":"IF(OR($E$5=$AD$5,$E$5=$AD$6,$E$5=$AD$7,$E$5=$AD$8),G26,IF(OR($E$5=$AD$9,$E$5=$AD$10,$E$5=$AD$11,$E$5=$AD$12),G26/0.5875))","v":70},{"$f":"+IF(AD26<0,0,AD26)","v":21.470202175092162},{"$f":" (-0.0022355889*(BI26)^2 + 0.4201809847*BI26 + 5.399628589)*LN((BQ26*(AC26/1000))/BA26)+(-0.0000029509*(BI26)^3 + 0.0099403371*(BI26)^2 - 1.9777335627*BI26+ 21.5271635053)+10*LOG(BA26)","v":26.681377985973043},{"$f":" 73.7573595264*LOG(BQ26)-119.2146207935+10*LOG(AC26/1000)","v":16.874938705287505},{"$f":"10*LOG(10^(0.1*BS26)+10^(0.1*BT26))","v":27.113262109087305},"LDB style/1","DLU","0°",{"$f":"IF(OR($E$5=$AD$5,$E$5=$AD$6,$E$5=$AD$7,$E$5=$AD$8),G26*(AC26/1000),((G26*0.5875)*(AC26/1000))*0.5875)","v":14.194550781249999}]
[null,null,null,null,{"$f":"IF($E$4=$AC$3,Legende!A23,IF($E$4=$AC$4,Legende!B23,IF($E$4=$AC$5,Legende!C23,IF($E$4=$AC$6,Legende!D23))))","v":"LDB 12 style"},{"$f":"IF($E$4=$AC$3,Legende!A27,IF($E$4=$AC$4,Legende!B27,IF($E$4=$AC$5,Legende!C27,IF($E$4=$AC$6,Legende!D27))))","v":"2-slot"},76.375,{"$f":"IF(OR($E$5=$AD$5,$E$5=$AD$6,$E$5=$AD$7,$E$5=$AD$8),\"m³/(h*m)\",IF(OR($E$5=$AD$9,$E$5=$AD$10,$E$5=$AD$11,$E$5=$AD$12),\"cfm/ft\",\"\"))","v":"cfm/ft"},{"$f":"IF(OR($E$5=$AD$5,$E$5=$AD$6,$E$5=$AD$7,$E$5=$AD$8),130,IF(OR($E$5=$AD$9,$E$5=$AD$10,$E$5=$AD$11,$E$5=$AD$12),130*0.5875,\"\"))","v":76.375},{"$f":"IF(OR($E$5=$AD$5,$E$5=$AD$6,$E$5=$AD$7,$E$5=$AD$8),\"m³/(h*m)\",IF(OR($E$5=$AD$9,$E$5=$AD$10,$E$5=$AD$11,$E$5=$AD$12),\"cfm\",\"\"))","v":"cfm"},"39,00 in",{"$f":"IF((ROUNDUP($L$6/(G27*AC27/1000),0))=0,1,ROUNDUP($L$6/(G27*AC27/1000),0))","v":8},{"$f":"IF(OR($E$5=$AD$5,$E$5=$AD$6,$E$5=$AD$7,$E$5=$AD$8),AC27*L27/1000,IF(OR($E$5=$AD$9,$E$5=$AD$10,$E$5=$AD$11,$E$5=$AD$12),AC27*L27/1000*3.28084))","v":26.24672},{"$f":"IF(OR($E$5=$AD$5,$E$5=$AD$6,$E$5=$AD$7,$E$5=$AD$8),\"m\",IF(OR($E$5=$AD$9,$E$5=$AD$10,$E$5=$AD$11,$E$5=$AD$12),\"ft\",\"\"))","v":"ft"},{"$f":"ROUND(1.6218*EXP(0.0609*AD27),0)","v":8},{"$f":"IF(OR($E$5=$AD$5,$E$5=$AD$6,$E$5=$AD$7,$E$5=$AD$8),AO27,IF(OR($E$5=$AD$9,$E$5=$AD$10,$E$5=$AD$11,$E$5=$AD$12),AO27*3.28084))","v":7.5459319999999996},{"$f":"IF(OR($E$5=$AD$5,$E$5=$AD$6,$E$5=$AD$7,$E$5=$AD$8),\"m\",IF(OR($E$5=$AD$9,$E$5=$AD$10,$E$5=$AD$11,$E$5=$AD$12),\"ft\",\"\"))","v":"ft"},{"$f":"IF(OR($E$5=$AD$5,$E$5=$AD$6,$E$5=$AD$7,$E$5=$AD$8),AZ27,IF(OR($E$5=$AD$9,$E$5=$AD$10,$E$5=$AD$11,$E$5=$AD$12),AZ27*3.28084))","v":0.59055119999999994},{"$f":"IF(OR($E$5=$AD$5,$E$5=$AD$6,$E$5=$AD$7,$E$5=$AD$8),\"m/s\",IF(OR($E$5=$AD$9,$E$5=$AD$10,$E$5=$AD$11,$E$5=$AD$12),\"ft/s\",\"\"))","v":"ft/s"},{"$f":"IF(OR($E$5=$AD$5,$E$5=$AD$6,$E$5=$AD$7,$E$5=$AD$8),ROUND(((34-$L$7)*((IF(AZ27<0.05,0.05,AZ27)-0.05)^0.62)*((0.37*IF(AZ27<0.05,0.05,AZ27)*40)+3.14)),0),IF(OR($E$5=$AD$9,$E$5=$AD$10,$E$5=$AD$11,$E$5=$AD$12),ROUND(((34-(($L$7-32)/1.8))*((IF(AZ27<0.05,0.05,AZ27)-0.05)^0.62)*((0.37*IF(AZ27<0.05,0.05,AZ27)*40)+3.14)),0)))","v":13},{"$f":"IF(T27<10,\"A\",IF(T27<20,\"B\",IF(T27<30,\"C\",\"keine\")))","v":"B"},{"$f":"ROUNDDOWN(IF(BU27<15,15,BU27),1)","v":27.3},2005,"cfm",{"$f":"ROUNDDOWN(10*LOG(L27*10^(0.1*V27))-$L$9,1)","v":29.9},null,null,null,1000,{"$f":"IF(OR($E$5=$AD$5,$E$5=$AD$6,$E$5=$AD$7,$E$5=$AD$8),+(LN(G27)-LN(54.787))/0.0326,IF(OR($E$5=$AD$9,$E$5=$AD$10,$E$5=$AD$11,$E$5=$AD$12),+(LN(G27/0.5875)-LN(54.787))/0.0326))","v":26.50556781968065},{"$f":"1.1648*EXP(0.0309*$AD$27)","v":2.6420931004053698},{"$f":"+AE27+(AH27-AE27)/3","v":2.4869867030560098},{"$f":"+(AF27+AH27)/2","v":2.3318803057066493},{"$f":"0.9247*EXP(0.0323*$AD$27)","v":2.1767739083572892},{"$f":"+(AH27+AJ27)/2","v":2.051064145825797},{"$f":"+(AH27+AL27)/2","v":1.9253543832943047},{"$f":"+(AJ27+AL27)/2","v":1.7996446207628125},{"$f":"0.655*EXP(0.0354*$AD$27)","v":1.6739348582313203},{"$f":"+(AL27+AN27)/2","v":1.5158491285589184},{"$f":"0.4728*EXP(0.0398*$AD$27)","v":1.3577633988865165},{"$f":"ROUND(HLOOKUP($AC$16,$AE$18:$AN$38,10,FALSE),1)","v":2.2999999999999998},{"$f":"11.644*EXP(0.0126*$AD$27)","v":16.260863043406221},{"$f":"AR27-(AR27-AP27)/2","v":17.101334457417828},{"$f":"AS27-(AS27-AP27)/3","v":17.94180587142943},{"$f":"13.343*EXP(0.0129*$AD$27)","v":18.782277285441033},{"$f":"AU27-(AU27-AS27)/2","v":19.146256995288915},{"$f":"AV27-(AV27-AS27)/3","v":19.510236705136794},{"$f":"AW27-(AW27-AS27)/4","v":19.874216414984673},{"$f":"15.526*EXP(0.01*$AD$27)","v":20.238196124832555},{"$f":"AY27-(AY27-AW27)/2","v":20.354772610564591},{"$f":"0.0129*$AD$27^2-0.4729*$AD$27+23.943","v":20.471349096296628},{"$f":"ROUND(HLOOKUP($AC$16,$AP$18:$AY$38,10,FALSE)/100,2)","v":0.18},{"$f":"IF(AC27<=$BB$18,BB27,IF(AND(AC27>$BB$18,AC27<=$BC$18),BC27,IF(AND(AC27>$BC$18,AC27<=$BD$18),BD27,IF(AND(AC27>$BD$18,AC27<=$BE$18),BE27,IF(AND(AC27>$BE$18,AC27<=$BF$18),BF27,IF(AND(AC27>$BF$18,AC27<=$BG$18),BG27,IF(AND(AC27>$BG$18,AC27<=$BH$18),BH27,IF(AC27>$BH$18,BH27))))))))","v":1},1,1,1,1,2,2,2,{"$f":"IF(AC27<=$BJ$18,BJ27,IF(AND(AC27>$BJ$18,AC27<=$BK$18),BK27,IF(AND(AC27>$BK$18,AC27<=$BL$18),BL27,IF(AND(AC27>$BL$18,AC27<=$BM$18),BM27,IF(AND(AC27>$BM$18,AC27<=$BN$18),BN27,IF(AND(AC27>$BN$18,AC27<=$BO$18),BO27,IF(AND(AC27>$BO$18,AC27<=$BP$18),BP27,IF(AC27>$BP$18,BP27))))))))","v":125},80,100,125,140,100,100,125,{"$f":"IF(OR($E$5=$AD$5,$E$5=$AD$6,$E$5=$AD$7,$E$5=$AD$8),G27,IF(OR($E$5=$AD$9,$E$5=$AD$10,$E$5=$AD$11,$E$5=$AD$12),G27/0.5875))","v":130},{"$f":"+IF(AD27<0,0,AD27)","v":26.50556781968065},{"$f":" (0.000000036775*BI27^4 - 0.000097789296*BI27^3 + 0.031851098925*BI27^2 - 3.518164042311*BI27 + 153.06267686179)*LN((BQ27*(AC27/1000))/BA27)+(-0.000001589267*BI27^4 + 0.001198286334*BI27^3 - 0.287868077763*BI27^2 + 27.229051331336*BI27- 974.551194289673)","v":24.450825151756561},{"$f":" 53.6850931947*LOG(BQ27)  -89.3138537125+10*LOG(AC27/1000)","v":24.17339216440908},{"$f":"10*LOG(10^(0.1*BS27)+10^(0.1*BT27))","v":27.324623585838438},"LDB style/2","DLU","0°",{"$f":"IF(OR($E$5=$AD$5,$E$5=$AD$6,$E$5=$AD$7,$E$5=$AD$8),G27*(AC27/1000),((G27*0.5875)*(AC27/1000))*0.5875)","v":26.361308593750003}]
[null,null,null,null,{"$f":"IF($E$4=$AC$3,Legende!A23,IF($E$4=$AC$4,Legende!B23,IF($E$4=$AC$5,Legende!C23,IF($E$4=$AC$6,Legende!D23))))","v":"LDB 12 style"},{"$f":"IF($E$4=$AC$3,Legende!A28,IF($E$4=$AC$4,Legende!B28,IF($E$4=$AC$5,Legende!C28,IF($E$4=$AC$6,Legende!D28))))","v":"3-slot"},111.625,{"$f":"IF(OR($E$5=$AD$5,$E$5=$AD$6,$E$5=$AD$7,$E$5=$AD$8),\"m³/(h*m)\",IF(OR($E$5=$AD$9,$E$5=$AD$10,$E$5=$AD$11,$E$5=$AD$12),\"cfm/ft\",\"\"))","v":"cfm/ft"},{"$f":"IF(OR($E$5=$AD$5,$E$5=$AD$6,$E$5=$AD$7,$E$5=$AD$8),190,IF(OR($E$5=$AD$9,$E$5=$AD$10,$E$5=$AD$11,$E$5=$AD$12),190*0.5875,\"\"))","v":111.625},{"$f":"IF(OR($E$5=$AD$5,$E$5=$AD$6,$E$5=$AD$7,$E$5=$AD$8),\"m³/(h*m)\",IF(OR($E$5=$AD$9,$E$5=$AD$10,$E$5=$AD$11,$E$5=$AD$12),\"cfm\",\"\"))","v":"cfm"},"39,00 in",{"$f":"IF((ROUNDUP($L$6/(G28*AC28/1000),0))=0,1,ROUNDUP($L$6/(G28*AC28/1000),0))","v":6},{"$f":"IF(OR($E$5=$AD$5,$E$5=$AD$6,$E$5=$AD$7,$E$5=$AD$8),AC28*L28/1000,IF(OR($E$5=$AD$9,$E$5=$AD$10,$E$5=$AD$11,$E$5=$AD$12),AC28*L28/1000*3.28084))","v":19.685040000000001},{"$f":"IF(OR($E$5=$AD$5,$E$5=$AD$6,$E$5=$AD$7,$E$5=$AD$8),\"m\",IF(OR($E$5=$AD$9,$E$5=$AD$10,$E$5=$AD$11,$E$5=$AD$12),\"ft\",\"\"))","v":"ft"},{"$f":"ROUND(1.6778*EXP(0.0637*AD28),0)","v":8},{"$f":"IF(OR($E$5=$AD$5,$E$5=$AD$6,$E$5=$AD$7,$E$5=$AD$8),AO28,IF(OR($E$5=$AD$9,$E$5=$AD$10,$E$5=$AD$11,$E$5=$AD$12),AO28*3.28084))","v":5.2493440000000007},{"$f":"IF(OR($E$5=$AD$5,$E$5=$AD$6,$E$5=$AD$7,$E$5=$AD$8),\"m\",IF(OR($E$5=$AD$9,$E$5=$AD$10,$E$5=$AD$11,$E$5=$AD$12),\"ft\",\"\"))","v":"ft"},{"$f":"IF(OR($E$5=$AD$5,$E$5=$AD$6,$E$5=$AD$7,$E$5=$AD$8),AZ28,IF(OR($E$5=$AD$9,$E$5=$AD$10,$E$5=$AD$11,$E$5=$AD$12),AZ28*3.28084))","v":0.55774279999999998},{"$f":"IF(OR($E$5=$AD$5,$E$5=$AD$6,$E$5=$AD$7,$E$5=$AD$8),\"m/s\",IF(OR($E$5=$AD$9,$E$5=$AD$10,$E$5=$AD$11,$E$5=$AD$12),\"ft/s\",\"\"))","v":"ft/s"},{"$f":"IF(OR($E$5=$AD$5,$E$5=$AD$6,$E$5=$AD$7,$E$5=$AD$8),ROUND(((34-$L$7)*((IF(AZ28<0.05,0.05,AZ28)-0.05)^0.62)*((0.37*IF(AZ28<0.05,0.05,AZ28)*40)+3.14)),0),IF(OR($E$5=$AD$9,$E$5=$AD$10,$E$5=$AD$11,$E$5=$AD$12),ROUND(((34-(($L$7-32)/1.8))*((IF(AZ28<0.05,0.05,AZ28)-0.05)^0.62)*((0.37*IF(AZ28<0.05,0.05,AZ28)*40)+3.14)),0)))","v":12},{"$f":"IF(T28<10,\"A\",IF(T28<20,\"B\",IF(T28<30,\"C\",\"keine\")))","v":"B"},{"$f":"ROUNDDOWN(IF(BU28<15,15,BU28),1)","v":31.2},2197,"cfm",{"$f":"ROUNDDOWN(10*LOG(L28*10^(0.1*V28))-$L$9,1)","v":32.5},null,null,null,1000,{"$f":"IF(OR($E$5=$AD$5,$E$5=$AD$6,$E$5=$AD$7,$E$5=$AD$8),+(LN(G28)-LN(86.228))/0.0323,IF(OR($E$5=$AD$9,$E$5=$AD$10,$E$5=$AD$11,$E$5=$AD$12),+(LN(G28/0.5875)-LN(86.228))/0.0323))","v":24.459105921030933},{"$f":"0.8069*EXP(0.034*$AD$28)","v":1.8534598231886144},{"$f":"+AE28+(AH28-AE28)/3","v":1.7446392790733702},{"$f":"+(AF28+AH28)/2","v":1.6358187349581261},{"$f":"0.693*EXP(0.0323*$AD$28)","v":1.526998190842882},{"$f":"+(AH28+AJ28)/2","v":1.4617876714113889},{"$f":"+(AH28+AL28)/2","v":1.3965771519798955},{"$f":"+(AJ28+AL28)/2","v":1.3313666325484022},{"$f":"0.4842*EXP(0.0393*$AD$28)","v":1.266156113116909},{"$f":"+(AL28+AN28)/2","v":1.1504011278190363},{"$f":"0.3947*EXP(0.0394*$AD$28)","v":1.0346461425211637},{"$f":"ROUND(HLOOKUP($AC$16,$AE$18:$AN$38,11,FALSE),1)","v":1.6},{"$f":"15.159*EXP(0.0091*$AD$28)","v":18.938033961507113},{"$f":"AR28-(AR28-AP28)/2","v":18.20874123735225},{"$f":"AS28-(AS28-AP28)/3","v":17.479448513197383},{"$f":"0.01*($AD$28)^2-0.31*$AD$28+18.35","v":16.750155789042516},{"$f":"AU28-(AU28-AS28)/2","v":17.066421558672218},{"$f":"AV28-(AV28-AS28)/3","v":17.382687328301916},{"$f":"AW28-(AW28-AS28)/4","v":17.698953097931614},{"$f":"0.02*$AD$28^2-0.74*$AD$28+24.15","v":18.015218867561316},{"$f":"AY28-(AY28-AW28)/2","v":18.811854630720081},{"$f":"0.02*($AD$28)^2-0.82*$AD$28+27.7","v":19.608490393878846},{"$f":"ROUND(HLOOKUP($AC$16,$AP$18:$AY$38,11,FALSE)/100,2)","v":0.17},{"$f":"IF(AC28<=$BB$18,BB28,IF(AND(AC28>$BB$18,AC28<=$BC$18),BC28,IF(AND(AC28>$BC$18,AC28<=$BD$18),BD28,IF(AND(AC28>$BD$18,AC28<=$BE$18),BE28,IF(AND(AC28>$BE$18,AC28<=$BF$18),BF28,IF(AND(AC28>$BF$18,AC28<=$BG$18),BG28,IF(AND(AC28>$BG$18,AC28<=$BH$18),BH28,IF(AC28>$BH$18,BH28))))))))","v":1},1,1,1,2,2,2,2,{"$f":"IF(AC28<=$BJ$18,BJ28,IF(AND(AC28>$BJ$18,AC28<=$BK$18),BK28,IF(AND(AC28>$BK$18,AC28<=$BL$18),BL28,IF(AND(AC28>$BL$18,AC28<=$BM$18),BM28,IF(AND(AC28>$BM$18,AC28<=$BN$18),BN28,IF(AND(AC28>$BN$18,AC28<=$BO$18),BO28,IF(AND(AC28>$BO$18,AC28<=$BP$18),BP28,IF(AC28>$BP$18,BP28))))))))","v":140},100,125,140,140,140,140,140,{"$f":"IF(OR($E$5=$AD$5,$E$5=$AD$6,$E$5=$AD$7,$E$5=$AD$8),G28,IF(OR($E$5=$AD$9,$E$5=$AD$10,$E$5=$AD$11,$E$5=$AD$12),G28/0.5875))","v":190},{"$f":"+IF(AD28<0,0,AD28)","v":24.459105921030933},{"$f":"(-0.000023788293*BI28^3 + 0.006551313626*BI28^2 - 0.573673222638*BI28 + 42.996345567831)*LN((BQ28*(AC28/1000))/BA28)+(0.000099312149*BI28^3 - 0.024864140926*BI28^2 + 1.505393168403*BI28 - 101.04319263046)+10*LOG(BA28)","v":30.327427474547477},{"$f":"57.5627700098*LOG(BQ28) -107.295103557+10*LOG(AC28/1000)","v":23.876265883651257},{"$f":"10*LOG(10^(0.1*BS28)+10^(0.1*BT28))","v":31.213762587858437},"LDB style/3","DLU","0°",{"$f":"IF(OR($E$5=$AD$5,$E$5=$AD$6,$E$5=$AD$7,$E$5=$AD$8),G28*(AC28/1000),((G28*0.5875)*(AC28/1000))*0.5875)","v":38.528066406250005}]
[null,null,null,null,{"$f":"IF($E$4=$AC$3,Legende!A23,IF($E$4=$AC$4,Legende!B23,IF($E$4=$AC$5,Legende!C23,IF($E$4=$AC$6,Legende!D23))))","v":"LDB 12 style"},{"$f":"IF($E$4=$AC$3,Legende!A29,IF($E$4=$AC$4,Legende!B29,IF($E$4=$AC$5,Legende!C29,IF($E$4=$AC$6,Legende!D29))))","v":"4-slot"},146.875,{"$f":"IF(OR($E$5=$AD$5,$E$5=$AD$6,$E$5=$AD$7,$E$5=$AD$8),\"m³/(h*m)\",IF(OR($E$5=$AD$9,$E$5=$AD$10,$E$5=$AD$11,$E$5=$AD$12),\"cfm/ft\",\"\"))","v":"cfm/ft"},{"$f":"IF(OR($E$5=$AD$5,$E$5=$AD$6,$E$5=$AD$7,$E$5=$AD$8),250,IF(OR($E$5=$AD$9,$E$5=$AD$10,$E$5=$AD$11,$E$5=$AD$12),250*0.5875,\"\"))","v":146.875},{"$f":"IF(OR($E$5=$AD$5,$E$5=$AD$6,$E$5=$AD$7,$E$5=$AD$8),\"m³/(h*m)\",IF(OR($E$5=$AD$9,$E$5=$AD$10,$E$5=$AD$11,$E$5=$AD$12),\"cfm\",\"\"))","v":"cfm"},"39,00 in",{"$f":"IF((ROUNDUP($L$6/(G29*AC29/1000),0))=0,1,ROUNDUP($L$6/(G29*AC29/1000),0))","v":4},{"$f":"IF(OR($E$5=$AD$5,$E$5=$AD$6,$E$5=$AD$7,$E$5=$AD$8),AC29*L29/1000,IF(OR($E$5=$AD$9,$E$5=$AD$10,$E$5=$AD$11,$E$5=$AD$12),AC29*L29/1000*3.28084))","v":13.12336},{"$f":"IF(OR($E$5=$AD$5,$E$5=$AD$6,$E$5=$AD$7,$E$5=$AD$8),\"m\",IF(OR($E$5=$AD$9,$E$5=$AD$10,$E$5=$AD$11,$E$5=$AD$12),\"ft\",\"\"))","v":"ft"},{"$f":"ROUND(1.6778*EXP(0.0637*AD30),0)","v":8},{"$f":"IF(OR($E$5=$AD$5,$E$5=$AD$6,$E$5=$AD$7,$E$5=$AD$8),AO29,IF(OR($E$5=$AD$9,$E$5=$AD$10,$E$5=$AD$11,$E$5=$AD$12),AO29*3.28084))","v":10.498688000000001},{"$f":"IF(OR($E$5=$AD$5,$E$5=$AD$6,$E$5=$AD$7,$E$5=$AD$8),\"m\",IF(OR($E$5=$AD$9,$E$5=$AD$10,$E$5=$AD$11,$E$5=$AD$12),\"ft\",\"\"))","v":"ft"},{"$f":"IF(OR($E$5=$AD$5,$E$5=$AD$6,$E$5=$AD$7,$E$5=$AD$8),AZ29,IF(OR($E$5=$AD$9,$E$5=$AD$10,$E$5=$AD$11,$E$5=$AD$12),AZ29*3.28084))","v":0.65616800000000008},{"$f":"IF(OR($E$5=$AD$5,$E$5=$AD$6,$E$5=$AD$7,$E$5=$AD$8),\"m/s\",IF(OR($E$5=$AD$9,$E$5=$AD$10,$E$5=$AD$11,$E$5=$AD$12),\"ft/s\",\"\"))","v":"ft/s"},{"$f":"IF(OR($E$5=$AD$5,$E$5=$AD$6,$E$5=$AD$7,$E$5=$AD$8),ROUND(((34-$L$7)*((IF(AZ29<0.05,0.05,AZ29)-0.05)^0.62)*((0.37*IF(AZ29<0.05,0.05,AZ29)*40)+3.14)),0),IF(OR($E$5=$AD$9,$E$5=$AD$10,$E$5=$AD$11,$E$5=$AD$12),ROUND(((34-(($L$7-32)/1.8))*((IF(AZ29<0.05,0.05,AZ29)-0.05)^0.62)*((0.37*IF(AZ29<0.05,0.05,AZ29)*40)+3.14)),0)))","v":15},{"$f":"IF(T29<10,\"A\",IF(T29<20,\"B\",IF(T29<30,\"C\",\"keine\")))","v":"B"},{"$f":"ROUNDDOWN(IF(BU29<15,15,BU29),1)","v":30},1927,"cfm",{"$f":"ROUNDDOWN(10*LOG(L29*10^(0.1*V29))-$L$9,1)","v":29.6},null,null,null,1000,{"$f":"IF(OR($E$5=$AD$5,$E$5=$AD$6,$E$5=$AD$7,$E$5=$AD$8),+(LN(G29)-LN(87.631))/0.0366,IF(OR($E$5=$AD$9,$E$5=$AD$10,$E$5=$AD$11,$E$5=$AD$12),+(LN(G29/0.5875)-LN(87.631))/0.0366))","v":28.642789651436416},{"$f":"0.5027*EXP(0.0724*$AD$29)","v":3.9987278077940269},{"$f":"+AE29+(AH29-AE29)/3","v":3.6041761177314919},{"$f":"+(AF29+AH29)/2","v":3.2096244276689569},{"$f":"0.3174*EXP(0.0762*$AD$29)","v":2.815072737606422},{"$f":"+(AH29+AJ29)/2","v":2.6300828607520095},{"$f":"+(AH29+AL29)/2","v":2.445092983897597},{"$f":"+(AJ29+AL29)/2","v":2.260103107043185},{"$f":"0.1882*EXP(0.0838*$AD$29)","v":2.0751132301887725},{"$f":"+(AL29+AN29)/2","v":1.8901233533343602},{"$f":"+AL29+AL29-AJ29","v":1.705133476479948},{"$f":"ROUND(HLOOKUP($AC$16,$AE$18:$AN$38,12,FALSE),1)","v":3.2},{"$f":"0.005*($AD$29)^2-0.105*$AD$29+15.525","v":16.619554081681343},{"$f":"AR29-(AR29-AP29)/2","v":18.087040039623282},{"$f":"AS29-(AS29-AP29)/3","v":19.554525997565225},{"$f":"0.0214*($AD$29)^2-0.6471*$AD$29+22","v":21.022011955507164},{"$f":"AU29-(AU29-AS29)/2","v":21.492781789909404},{"$f":"0.0229*($AD$29)^2-0.8143*$AD$29+26.5","v":21.963551624311645},{"$f":"+AU29+AU29-AT29","v":22.434321458713885},{"$f":"+AV29+AV29-AU29","v":22.905091293116126},{"$f":"+AW29+AW29-AV29","v":23.375861127518366},23.846630961920606,{"$f":"ROUND(HLOOKUP($AC$16,$AP$18:$AY$38,12,FALSE)/100,2)","v":0.2},{"$f":"IF(AC29<=$BB$18,BB29,IF(AND(AC29>$BB$18,AC29<=$BC$18),BC29,IF(AND(AC29>$BC$18,AC29<=$BD$18),BD29,IF(AND(AC29>$BD$18,AC29<=$BE$18),BE29,IF(AND(AC29>$BE$18,AC29<=$BF$18),BF29,IF(AND(AC29>$BF$18,AC29<=$BG$18),BG29,IF(AND(AC29>$BG$18,AC29<=$BH$18),BH29,IF(AC29>$BH$18,BH29))))))))","v":2},1,1,2,2,2,2,2,{"$f":"IF(AC29<=$BJ$18,BJ29,IF(AND(AC29>$BJ$18,AC29<=$BK$18),BK29,IF(AND(AC29>$BK$18,AC29<=$BL$18),BL29,IF(AND(AC29>$BL$18,AC29<=$BM$18),BM29,IF(AND(AC29>$BM$18,AC29<=$BN$18),BN29,IF(AND(AC29>$BN$18,AC29<=$BO$18),BO29,IF(AND(AC29>$BO$18,AC29<=$BP$18),BP29,IF(AC29>$BP$18,BP29))))))))","v":125},125,140,125,125,140,160,160,{"$f":"IF(OR($E$5=$AD$5,$E$5=$AD$6,$E$5=$AD$7,$E$5=$AD$8),G29,IF(OR($E$5=$AD$9,$E$5=$AD$10,$E$5=$AD$11,$E$5=$AD$12),G29/0.5875))","v":250},{"$f":"+IF(AD29<0,0,AD29)","v":28.642789651436416},{"$f":"(-0.000023788293*BI29^3 + 0.006551313626*BI29^2 - 0.573673222638*BI29 + 42.996345567831)*LN((BQ29*(AC29/1000))/BA29)+(0.000099312149*BI29^3 - 0.024864140926*BI29^2 + 1.505393168403*BI29 - 101.04319263046)+10*LOG(BA29)","v":26.88974198001381},{"$f":" 62.1456597122*LOG(BQ29) -121.8124227521+10*LOG(AC29/1000)","v":27.209141037102356},{"$f":"10*LOG(10^(0.1*BS29)+10^(0.1*BT29))","v":30.062677053242865},"LDB style/4","DLU","0°",{"$f":"IF(OR($E$5=$AD$5,$E$5=$AD$6,$E$5=$AD$7,$E$5=$AD$8),G29*(AC29/1000),((G29*0.5875)*(AC29/1000))*0.5875)","v":50.69482421875}]
[null,null,null,null,null,null,null,null,null,null,null,null,null,null,null,null,null,null,null,null,null,null,null,null,null,null,null,null,null,{"$f":"IF(OR($E$5=$AD$5,$E$5=$AD$6,$E$5=$AD$7,$E$5=$AD$8),+(LN(G29/4*3)-LN(86.228))/0.0323,IF(OR($E$5=$AD$9,$E$5=$AD$10,$E$5=$AD$11,$E$5=$AD$12),+(LN(G29/4*3/0.5875)-LN(86.228))/0.0323))","v":24.049036981401802},"Keine Messergebnisse, Dezugswertformel vom 3-Schlitzigen / 4 * 3, Druckverlust ebenfalls 3-Schlitzige Fromel benutzt. Geschwindigkeit und Akustik Formeln vom classic 4-Schlitzigen übernommen"]
[null,null,null,null,{"$f":"IF($E$4=$AC$3,Legende!A24,IF($E$4=$AC$4,Legende!B24,IF($E$4=$AC$5,Legende!C24,IF($E$4=$AC$6,Legende!D24))))","v":"LDB 20 classic"},{"$f":"IF($E$4=$AC$3,Legende!A26,IF($E$4=$AC$4,Legende!B26,IF($E$4=$AC$5,Legende!C26,IF($E$4=$AC$6,Legende!D26))))","v":"1-slot"},52.875,{"$f":"IF(OR($E$5=$AD$5,$E$5=$AD$6,$E$5=$AD$7,$E$5=$AD$8),\"m³/(h*m)\",IF(OR($E$5=$AD$9,$E$5=$AD$10,$E$5=$AD$11,$E$5=$AD$12),\"cfm/ft\",\"\"))","v":"cfm/ft"},{"$f":"IF(OR($E$5=$AD$5,$E$5=$AD$6,$E$5=$AD$7,$E$5=$AD$8),130,IF(OR($E$5=$AD$9,$E$5=$AD$10,$E$5=$AD$11,$E$5=$AD$12),130*0.5875,\"\"))","v":76.375},{"$f":"IF(OR($E$5=$AD$5,$E$5=$AD$6,$E$5=$AD$7,$E$5=$AD$8),\"m³/(h*m)\",IF(OR($E$5=$AD$9,$E$5=$AD$10,$E$5=$AD$11,$E$5=$AD$12),\"cfm\",\"\"))","v":"cfm"},"48,75 in",{"$f":"IF((ROUNDUP($L$6/(G31*AC31/1000),0))=0,1,ROUNDUP($L$6/(G31*AC31/1000),0))","v":9},{"$f":"IF(OR($E$5=$AD$5,$E$5=$AD$6,$E$5=$AD$7,$E$5=$AD$8),AC31*L31/1000,IF(OR($E$5=$AD$9,$E$5=$AD$10,$E$5=$AD$11,$E$5=$AD$12),AC31*L31/1000*3.28084))","v":36.90945},{"$f":"IF(OR($E$5=$AD$5,$E$5=$AD$6,$E$5=$AD$7,$E$5=$AD$8),\"m\",IF(OR($E$5=$AD$9,$E$5=$AD$10,$E$5=$AD$11,$E$5=$AD$12),\"ft\",\"\"))","v":"ft"},{"$f":"ROUND(1.2244*EXP(0.0739*AD31),0)","v":10},{"$f":"IF(OR($E$5=$AD$5,$E$5=$AD$6,$E$5=$AD$7,$E$5=$AD$8),AO31,IF(OR($E$5=$AD$9,$E$5=$AD$10,$E$5=$AD$11,$E$5=$AD$12),AO31*3.28084))","v":7.5459319999999996},{"$f":"IF(OR($E$5=$AD$5,$E$5=$AD$6,$E$5=$AD$7,$E$5=$AD$8),\"m\",IF(OR($E$5=$AD$9,$E$5=$AD$10,$E$5=$AD$11,$E$5=$AD$12),\"ft\",\"\"))","v":"ft"},{"$f":"IF(OR($E$5=$AD$5,$E$5=$AD$6,$E$5=$AD$7,$E$5=$AD$8),AZ31,IF(OR($E$5=$AD$9,$E$5=$AD$10,$E$5=$AD$11,$E$5=$AD$12),AZ31*3.28084))","v":0.52493440000000002},{"$f":"IF(OR($E$5=$AD$5,$E$5=$AD$6,$E$5=$AD$7,$E$5=$AD$8),\"m/s\",IF(OR($E$5=$AD$9,$E$5=$AD$10,$E$5=$AD$11,$E$5=$AD$12),\"ft/s\",\"\"))","v":"ft/s"},{"$f":"IF(OR($E$5=$AD$5,$E$5=$AD$6,$E$5=$AD$7,$E$5=$AD$8),ROUND(((34-$L$7)*((IF(AZ31<0.05,0.05,AZ31)-0.05)^0.62)*((0.37*IF(AZ31<0.05,0.05,AZ31)*40)+3.14)),0),IF(OR($E$5=$AD$9,$E$5=$AD$10,$E$5=$AD$11,$E$5=$AD$12),ROUND(((34-(($L$7-32)/1.8))*((IF(AZ31<0.05,0.05,AZ31)-0.05)^0.62)*((0.37*IF(AZ31<0.05,0.05,AZ31)*40)+3.14)),0)))","v":11},{"$f":"IF(T31<10,\"A\",IF(T31<20,\"B\",IF(T31<30,\"C\",\"keine\")))","v":"B"},{"$f":"ROUNDDOWN(IF(BU31<15,15,BU31),1)","v":30.8},1952,"cfm",{"$f":"ROUNDDOWN(10*LOG(L31*10^(0.1*V31))-$L$9,1)","v":33.9},null,null,null,1250,{"$f":"IF(OR($E$5=$AD$5,$E$5=$AD$6,$E$5=$AD$7,$E$5=$AD$8),+(LN(G31)-LN(31.634))/0.0362,IF(OR($E$5=$AD$9,$E$5=$AD$10,$E$5=$AD$11,$E$5=$AD$12),+(LN(G31/0.5875)-LN(31.634))/0.0362))","v":28.883347480358225},{"$f":"0.6716*EXP(0.0492*$AD$31)","v":2.7814387846474289},{"$f":"+AE31+(AH31-AE31)/3","v":2.5442221989817413},{"$f":"+(AF31+AH31)/2","v":2.3070056133160541},{"$f":"0.5159*EXP(0.0481*$AD$31)","v":2.0697890276503665},{"$f":"+(AH31+AJ31)/2","v":1.8657719125119658},{"$f":"+(AH31+AL31)/2","v":1.6617547973735651},{"$f":"+(AJ31+AL31)/2","v":1.4577376822351644},{"$f":"0.2341*EXP(0.0581*$AD$31)","v":1.2537205670967637},{"$f":"+(AL31+AN31)/2","v":1.049703451958363},{"$f":"+AL31+AL31-AJ31","v":0.8456863368199623},{"$f":"ROUND(HLOOKUP($AC$16,$AE$18:$AN$38,14,FALSE),1)","v":2.2999999999999998},{"$f":"0.005*($AD$31)^2-0.1479*$AD$31+14.514","v":14.413391716010597},{"$f":"AR31-(AR31-AP31)/2","v":15.190016466146439},{"$f":"AS31-(AS31-AP31)/3","v":15.96664121628228},{"$f":"0.0064*($AD$31)^2-0.215*$AD$31+17.614","v":16.743265966418122},{"$f":"AU31-(AU31-AS31)/2","v":17.27926408541785},{"$f":"AV31-(AV31-AS31)/3","v":17.815262204417575},{"$f":"AW31-(AW31-AS31)/4","v":18.3512603234173},{"$f":"0.0054*($AD$31)^2-0.1982*$AD$31+20.107","v":18.887258442417025},19.42325656141675,19.959254680416475,{"$f":"ROUND(HLOOKUP($AC$16,$AP$18:$AY$38,14,FALSE)/100,2)","v":0.16},{"$f":"IF(AC31<=$BB$18,BB31,IF(AND(AC31>$BB$18,AC31<=$BC$18),BC31,IF(AND(AC31>$BC$18,AC31<=$BD$18),BD31,IF(AND(AC31>$BD$18,AC31<=$BE$18),BE31,IF(AND(AC31>$BE$18,AC31<=$BF$18),BF31,IF(AND(AC31>$BF$18,AC31<=$BG$18),BG31,IF(AND(AC31>$BG$18,AC31<=$BH$18),BH31,IF(AC31>$BH$18,BH31))))))))","v":2},1,1,1,2,2,2,2,{"$f":"IF(AC31<=$BJ$18,BJ31,IF(AND(AC31>$BJ$18,AC31<=$BK$18),BK31,IF(AND(AC31>$BK$18,AC31<=$BL$18),BL31,IF(AND(AC31>$BL$18,AC31<=$BM$18),BM31,IF(AND(AC31>$BM$18,AC31<=$BN$18),BN31,IF(AND(AC31>$BN$18,AC31<=$BO$18),BO31,IF(AND(AC31>$BO$18,AC31<=$BP$18),BP31,IF(AC31>$BP$18,BP31))))))))","v":100},100,100,125,100,100,125,125,{"$f":"IF(OR($E$5=$AD$5,$E$5=$AD$6,$E$5=$AD$7,$E$5=$AD$8),G31,IF(OR($E$5=$AD$9,$E$5=$AD$10,$E$5=$AD$11,$E$5=$AD$12),G31/0.5875))","v":90},{"$f":"+IF(AD31<0,0,AD31)","v":28.883347480358225},{"$f":"(-0.0022355889*(BI31)^2 + 0.4201809847*BI31 + 5.399628589)*LN((BQ31*(AC31/1000))/BA31)+(-0.0000029509*(BI31)^3 + 0.0099403371*(BI31)^2 - 1.9777335627*BI31+ 21.5271635053)+10*LOG(BA31)","v":24.210924602780182},{"$f":"54.6883629879*LOG(BQ31) -78.1021786699+10*LOG(AC31/1000)","v":29.741245182782961},{"$f":"10*LOG(10^(0.1*BS31)+10^(0.1*BT31))","v":30.812929129914146},"LDB classic/1","DLU","0°",{"$f":"IF(OR($E$5=$AD$5,$E$5=$AD$6,$E$5=$AD$7,$E$5=$AD$8),G31*(AC31/1000),((G31*0.5875)*(AC31/1000))*0.5875)","v":22.812670898437499}]
[null,null,null,null,{"$f":"IF($E$4=$AC$3,Legende!A24,IF($E$4=$AC$4,Legende!B24,IF($E$4=$AC$5,Legende!C24,IF($E$4=$AC$6,Legende!D24))))","v":"LDB 20 classic"},{"$f":"IF($E$4=$AC$3,Legende!A27,IF($E$4=$AC$4,Legende!B27,IF($E$4=$AC$5,Legende!C27,IF($E$4=$AC$6,Legende!D27))))","v":"2-slot"},94,{"$f":"IF(OR($E$5=$AD$5,$E$5=$AD$6,$E$5=$AD$7,$E$5=$AD$8),\"m³/(h*m)\",IF(OR($E$5=$AD$9,$E$5=$AD$10,$E$5=$AD$11,$E$5=$AD$12),\"cfm/ft\",\"\"))","v":"cfm/ft"},{"$f":"IF(OR($E$5=$AD$5,$E$5=$AD$6,$E$5=$AD$7,$E$5=$AD$8),190,IF(OR($E$5=$AD$9,$E$5=$AD$10,$E$5=$AD$11,$E$5=$AD$12),190*0.5875,\"\"))","v":111.625},{"$f":"IF(OR($E$5=$AD$5,$E$5=$AD$6,$E$5=$AD$7,$E$5=$AD$8),\"m³/(h*m)\",IF(OR($E$5=$AD$9,$E$5=$AD$10,$E$5=$AD$11,$E$5=$AD$12),\"cfm\",\"\"))","v":"cfm"},"39,00 in",{"$f":"IF((ROUNDUP($L$6/(G32*AC32/1000),0))=0,1,ROUNDUP($L$6/(G32*AC32/1000),0))","v":7},{"$f":"IF(OR($E$5=$AD$5,$E$5=$AD$6,$E$5=$AD$7,$E$5=$AD$8),AC32*L32/1000,IF(OR($E$5=$AD$9,$E$5=$AD$10,$E$5=$AD$11,$E$5=$AD$12),AC32*L32/1000*3.28084))","v":22.965879999999999},{"$f":"IF(OR($E$5=$AD$5,$E$5=$AD$6,$E$5=$AD$7,$E$5=$AD$8),\"m\",IF(OR($E$5=$AD$9,$E$5=$AD$10,$E$5=$AD$11,$E$5=$AD$12),\"ft\",\"\"))","v":"ft"},{"$f":"ROUND(1.0351*EXP(0.0668*AD32),0)","v":9},{"$f":"IF(OR($E$5=$AD$5,$E$5=$AD$6,$E$5=$AD$7,$E$5=$AD$8),AO32,IF(OR($E$5=$AD$9,$E$5=$AD$10,$E$5=$AD$11,$E$5=$AD$12),AO32*3.28084))","v":11.482939999999999},{"$f":"IF(OR($E$5=$AD$5,$E$5=$AD$6,$E$5=$AD$7,$E$5=$AD$8),\"m\",IF(OR($E$5=$AD$9,$E$5=$AD$10,$E$5=$AD$11,$E$5=$AD$12),\"ft\",\"\"))","v":"ft"},{"$f":"IF(OR($E$5=$AD$5,$E$5=$AD$6,$E$5=$AD$7,$E$5=$AD$8),AZ32,IF(OR($E$5=$AD$9,$E$5=$AD$10,$E$5=$AD$11,$E$5=$AD$12),AZ32*3.28084))","v":0.62335960000000001},{"$f":"IF(OR($E$5=$AD$5,$E$5=$AD$6,$E$5=$AD$7,$E$5=$AD$8),\"m/s\",IF(OR($E$5=$AD$9,$E$5=$AD$10,$E$5=$AD$11,$E$5=$AD$12),\"ft/s\",\"\"))","v":"ft/s"},{"$f":"IF(OR($E$5=$AD$5,$E$5=$AD$6,$E$5=$AD$7,$E$5=$AD$8),ROUND(((34-$L$7)*((IF(AZ32<0.05,0.05,AZ32)-0.05)^0.62)*((0.37*IF(AZ32<0.05,0.05,AZ32)*40)+3.14)),0),IF(OR($E$5=$AD$9,$E$5=$AD$10,$E$5=$AD$11,$E$5=$AD$12),ROUND(((34-(($L$7-32)/1.8))*((IF(AZ32<0.05,0.05,AZ32)-0.05)^0.62)*((0.37*IF(AZ32<0.05,0.05,AZ32)*40)+3.14)),0)))","v":14},{"$f":"IF(T32<10,\"A\",IF(T32<20,\"B\",IF(T32<30,\"C\",\"keine\")))","v":"B"},{"$f":"ROUNDDOWN(IF(BU32<15,15,BU32),1)","v":32.799999999999997},2159,"cfm",{"$f":"ROUNDDOWN(10*LOG(L32*10^(0.1*V32))-$L$9,1)","v":34.799999999999997},null,null,null,1000,{"$f":"IF(OR($E$5=$AD$5,$E$5=$AD$6,$E$5=$AD$7,$E$5=$AD$8),+(LN(G32)-LN(56.314))/0.0325,IF(OR($E$5=$AD$9,$E$5=$AD$10,$E$5=$AD$11,$E$5=$AD$12),+(LN(G32/0.5875)-LN(56.314))/0.0325))","v":32.130173635387941},{"$f":"0.8253*EXP(0.0508*$AD$32)","v":4.2215590303513242},{"$f":"+AE32+(AH32-AE32)/3","v":3.8620700162521899},{"$f":"+(AF32+AH32)/2","v":3.5025810021530557},{"$f":"0.558*EXP(0.0538*$AD$32)","v":3.1430919880539214},{"$f":"+(AH32+AJ32)/2","v":2.9035797553489369},{"$f":"+(AH32+AL32)/2","v":2.6640675226439523},{"$f":"+(AJ32+AL32)/2","v":2.4245552899389677},{"$f":"0.3078*EXP(0.061*$AD$32)","v":2.1850430572339832},{"$f":"+(AL32+AN32)/2","v":1.9455308245289986},{"$f":"+AL32+AL32-AJ32","v":1.7060185918240141},{"$f":"ROUND(HLOOKUP($AC$16,$AE$18:$AN$38,15,FALSE),1)","v":3.5},{"$f":"0.0057*($AD$32)^2-0.0686*$AD$32+18","v":21.680254018301405},{"$f":"AR32-(AR32-AP32)/2","v":20.518192050578669},{"$f":"AS32-(AS32-AP32)/3","v":19.356130082855938},{"$f":"0.0068*($AD$32)^2-0.1882*$AD$32+17.221","v":18.194068115133202},{"$f":"AU32-(AU32-AS32)/2","v":19.032974171583994},{"$f":"AV32-(AV32-AS32)/3","v":19.87188022803479},{"$f":"AW32-(AW32-AS32)/4","v":20.710786284485582},{"$f":"0.0286*($AD$32)^2-1.3771*$AD$32+36.271","v":21.549692340936375},22.388598397387167,23.227504453837959,{"$f":"ROUND(HLOOKUP($AC$16,$AP$18:$AY$38,15,FALSE)/100,2)","v":0.19},{"$f":"IF(AC32<=$BB$18,BB32,IF(AND(AC32>$BB$18,AC32<=$BC$18),BC32,IF(AND(AC32>$BC$18,AC32<=$BD$18),BD32,IF(AND(AC32>$BD$18,AC32<=$BE$18),BE32,IF(AND(AC32>$BE$18,AC32<=$BF$18),BF32,IF(AND(AC32>$BF$18,AC32<=$BG$18),BG32,IF(AND(AC32>$BG$18,AC32<=$BH$18),BH32,IF(AC32>$BH$18,BH32))))))))","v":1},1,1,1,2,2,2,2,{"$f":"IF(AC32<=$BJ$18,BJ32,IF(AND(AC32>$BJ$18,AC32<=$BK$18),BK32,IF(AND(AC32>$BK$18,AC32<=$BL$18),BL32,IF(AND(AC32>$BL$18,AC32<=$BM$18),BM32,IF(AND(AC32>$BM$18,AC32<=$BN$18),BN32,IF(AND(AC32>$BN$18,AC32<=$BO$18),BO32,IF(AND(AC32>$BO$18,AC32<=$BP$18),BP32,IF(AC32>$BP$18,BP32))))))))","v":125},100,125,125,100,125,125,125,{"$f":"IF(OR($E$5=$AD$5,$E$5=$AD$6,$E$5=$AD$7,$E$5=$AD$8),G32,IF(OR($E$5=$AD$9,$E$5=$AD$10,$E$5=$AD$11,$E$5=$AD$12),G32/0.5875))","v":160},{"$f":"+IF(AD32<0,0,AD32)","v":32.130173635387941},{"$f":" (0.000000036775*BI32^4 - 0.000097789296*BI32^3 + 0.031851098925*BI32^2 - 3.518164042311*BI32 + 153.06267686179)*LN((BQ32*(AC32/1000))/BA32)+(-0.000001589267*BI32^4 + 0.001198286334*BI32^3 - 0.287868077763*BI32^2 + 27.229051331336*BI32- 974.551194289673)","v":30.461807232592435},{"$f":"  53.6850931947*LOG(BQ32) -89.3138537125+10*LOG(AC32/1000)","v":29.014532968683852},{"$f":"10*LOG(10^(0.1*BS32)+10^(0.1*BT32))","v":32.808480655342905},"LDB classic/2","DLU","0°",{"$f":"IF(OR($E$5=$AD$5,$E$5=$AD$6,$E$5=$AD$7,$E$5=$AD$8),G32*(AC32/1000),((G32*0.5875)*(AC32/1000))*0.5875)","v":32.444687500000001}]
[null,null,null,null,{"$f":"IF($E$4=$AC$3,Legende!A24,IF($E$4=$AC$4,Legende!B24,IF($E$4=$AC$5,Legende!C24,IF($E$4=$AC$6,Legende!D24))))","v":"LDB 20 classic"},{"$f":"IF($E$4=$AC$3,Legende!A28,IF($E$4=$AC$4,Legende!B28,IF($E$4=$AC$5,Legende!C28,IF($E$4=$AC$6,Legende!D28))))","v":"3-slot"},146.875,{"$f":"IF(OR($E$5=$AD$5,$E$5=$AD$6,$E$5=$AD$7,$E$5=$AD$8),\"m³/(h*m)\",IF(OR($E$5=$AD$9,$E$5=$AD$10,$E$5=$AD$11,$E$5=$AD$12),\"cfm/ft\",\"\"))","v":"cfm/ft"},{"$f":"IF(OR($E$5=$AD$5,$E$5=$AD$6,$E$5=$AD$7,$E$5=$AD$8),250,IF(OR($E$5=$AD$9,$E$5=$AD$10,$E$5=$AD$11,$E$5=$AD$12),250*0.5875,\"\"))","v":146.875},{"$f":"IF(OR($E$5=$AD$5,$E$5=$AD$6,$E$5=$AD$7,$E$5=$AD$8),\"m³/(h*m)\",IF(OR($E$5=$AD$9,$E$5=$AD$10,$E$5=$AD$11,$E$5=$AD$12),\"cfm\",\"\"))","v":"cfm"},"48,75 in",{"$f":"IF((ROUNDUP($L$6/(G33*AC33/1000),0))=0,1,ROUNDUP($L$6/(G33*AC33/1000),0))","v":4},{"$f":"IF(OR($E$5=$AD$5,$E$5=$AD$6,$E$5=$AD$7,$E$5=$AD$8),AC33*L33/1000,IF(OR($E$5=$AD$9,$E$5=$AD$10,$E$5=$AD$11,$E$5=$AD$12),AC33*L33/1000*3.28084))","v":16.404199999999999},{"$f":"IF(OR($E$5=$AD$5,$E$5=$AD$6,$E$5=$AD$7,$E$5=$AD$8),\"m\",IF(OR($E$5=$AD$9,$E$5=$AD$10,$E$5=$AD$11,$E$5=$AD$12),\"ft\",\"\"))","v":"ft"},{"$f":"ROUND(0.7972*EXP(0.0692*AD33),0)","v":9},{"$f":"IF(OR($E$5=$AD$5,$E$5=$AD$6,$E$5=$AD$7,$E$5=$AD$8),AO33,IF(OR($E$5=$AD$9,$E$5=$AD$10,$E$5=$AD$11,$E$5=$AD$12),AO33*3.28084))","v":16.404199999999999},{"$f":"IF(OR($E$5=$AD$5,$E$5=$AD$6,$E$5=$AD$7,$E$5=$AD$8),\"m\",IF(OR($E$5=$AD$9,$E$5=$AD$10,$E$5=$AD$11,$E$5=$AD$12),\"ft\",\"\"))","v":"ft"},{"$f":"IF(OR($E$5=$AD$5,$E$5=$AD$6,$E$5=$AD$7,$E$5=$AD$8),AZ33,IF(OR($E$5=$AD$9,$E$5=$AD$10,$E$5=$AD$11,$E$5=$AD$12),AZ33*3.28084))","v":0.7217848},{"$f":"IF(OR($E$5=$AD$5,$E$5=$AD$6,$E$5=$AD$7,$E$5=$AD$8),\"m/s\",IF(OR($E$5=$AD$9,$E$5=$AD$10,$E$5=$AD$11,$E$5=$AD$12),\"ft/s\",\"\"))","v":"ft/s"},{"$f":"IF(OR($E$5=$AD$5,$E$5=$AD$6,$E$5=$AD$7,$E$5=$AD$8),ROUND(((34-$L$7)*((IF(AZ33<0.05,0.05,AZ33)-0.05)^0.62)*((0.37*IF(AZ33<0.05,0.05,AZ33)*40)+3.14)),0),IF(OR($E$5=$AD$9,$E$5=$AD$10,$E$5=$AD$11,$E$5=$AD$12),ROUND(((34-(($L$7-32)/1.8))*((IF(AZ33<0.05,0.05,AZ33)-0.05)^0.62)*((0.37*IF(AZ33<0.05,0.05,AZ33)*40)+3.14)),0)))","v":17},{"$f":"IF(T33<10,\"A\",IF(T33<20,\"B\",IF(T33<30,\"C\",\"keine\")))","v":"B"},{"$f":"ROUNDDOWN(IF(BU33<15,15,BU33),1)","v":31.2},2409,"cfm",{"$f":"ROUNDDOWN(10*LOG(L33*10^(0.1*V33))-$L$9,1)","v":30.8},null,null,null,1250,{"$f":"IF(OR($E$5=$AD$5,$E$5=$AD$6,$E$5=$AD$7,$E$5=$AD$8),+(LN(G33)-LN(74.282))/0.0342,IF(OR($E$5=$AD$9,$E$5=$AD$10,$E$5=$AD$11,$E$5=$AD$12),+(LN(G33/0.5875)-LN(74.282))/0.0342))","v":35.485153701524219},{"$f":"0.6244*EXP(0.0654*$AD$33)","v":6.3583248973337865},{"$f":"+AE33+(AH33-AE33)/3","v":5.6775145817603976},{"$f":"+(AF33+AH33)/2","v":4.9967042661870078},{"$f":"0.4407*EXP(0.0643*$AD$33)","v":4.3158939506136189},{"$f":"+(AH33+AJ33)/2","v":4.0667108046142193},{"$f":"+(AH33+AL33)/2","v":3.8175276586148197},{"$f":"+(AJ33+AL33)/2","v":3.5683445126154201},{"$f":"0.2489*EXP(0.073*$AD$33)","v":3.3191613666160205},{"$f":"+(AL33+AN33)/2","v":3.0699782206166208},{"$f":"+AL33+AL33-AJ33","v":2.8207950746172212},{"$f":"ROUND(HLOOKUP($AC$16,$AE$18:$AN$38,16,FALSE),1)","v":5},{"$f":"0.005*($AD$33)^2-0.105*$AD$33+15.525","v":18.095039527443948},{"$f":"AR33-(AR33-AP33)/2","v":19.884666144056098},{"$f":"AS33-(AS33-AP33)/3","v":21.674292760668244},{"$f":"0.0129*($AD$33)^2-0.3529*$AD$33+19.743","v":23.463919377280394},{"$f":"AU33-(AU33-AS33)/2","v":24.750003871948952},{"$f":"0.0196*($AD$33)^2-0.6496*$AD$33+24.407","v":26.036088366617509},{"$f":"+AU33+AU33-AT33","v":27.322172861286067},{"$f":"+AV33+AV33-AU33","v":28.608257355954624},29.894341850623182,31.180426345291739,{"$f":"ROUND(HLOOKUP($AC$16,$AP$18:$AY$38,16,FALSE)/100,2)","v":0.22},{"$f":"IF(AC33<=$BB$18,BB33,IF(AND(AC33>$BB$18,AC33<=$BC$18),BC33,IF(AND(AC33>$BC$18,AC33<=$BD$18),BD33,IF(AND(AC33>$BD$18,AC33<=$BE$18),BE33,IF(AND(AC33>$BE$18,AC33<=$BF$18),BF33,IF(AND(AC33>$BF$18,AC33<=$BG$18),BG33,IF(AND(AC33>$BG$18,AC33<=$BH$18),BH33,IF(AC33>$BH$18,BH33))))))))","v":2},1,1,1,2,2,2,3,{"$f":"IF(AC33<=$BJ$18,BJ33,IF(AND(AC33>$BJ$18,AC33<=$BK$18),BK33,IF(AND(AC33>$BK$18,AC33<=$BL$18),BL33,IF(AND(AC33>$BL$18,AC33<=$BM$18),BM33,IF(AND(AC33>$BM$18,AC33<=$BN$18),BN33,IF(AND(AC33>$BN$18,AC33<=$BO$18),BO33,IF(AND(AC33>$BO$18,AC33<=$BP$18),BP33,IF(AC33>$BP$18,BP33))))))))","v":140},125,140,140,140,140,140,140,{"$f":"IF(OR($E$5=$AD$5,$E$5=$AD$6,$E$5=$AD$7,$E$5=$AD$8),G33,IF(OR($E$5=$AD$9,$E$5=$AD$10,$E$5=$AD$11,$E$5=$AD$12),G33/0.5875))","v":250},{"$f":"+IF(AD33<0,0,AD33)","v":35.485153701524219},{"$f":"(-0.000023788293*BI33^3 + 0.006551313626*BI33^2 - 0.573673222638*BI33 + 42.996345567831)*LN((BQ33*(AC33/1000))/BA33)+(0.000099312149*BI33^3 - 0.024864140926*BI33^2 + 1.505393168403*BI33 - 101.04319263046)+10*LOG(BA33)","v":28.289607912649302},{"$f":" 65.3168380226*LOG(BQ33) -129.3287746354+10*LOG(AC33/1000)","v":28.266184629024053},{"$f":"10*LOG(10^(0.1*BS33)+10^(0.1*BT33))","v":31.288212018879953},"LDB classic/3","DLU","0°",{"$f":"IF(OR($E$5=$AD$5,$E$5=$AD$6,$E$5=$AD$7,$E$5=$AD$8),G33*(AC33/1000),((G33*0.5875)*(AC33/1000))*0.5875)","v":63.3685302734375}]
[null,null,null,null,{"$f":"IF($E$4=$AC$3,Legende!A24,IF($E$4=$AC$4,Legende!B24,IF($E$4=$AC$5,Legende!C24,IF($E$4=$AC$6,Legende!D24))))","v":"LDB 20 classic"},{"$f":"IF($E$4=$AC$3,Legende!A29,IF($E$4=$AC$4,Legende!B29,IF($E$4=$AC$5,Legende!C29,IF($E$4=$AC$6,Legende!D29))))","v":"4-slot"},176.25,{"$f":"IF(OR($E$5=$AD$5,$E$5=$AD$6,$E$5=$AD$7,$E$5=$AD$8),\"m³/(h*m)\",IF(OR($E$5=$AD$9,$E$5=$AD$10,$E$5=$AD$11,$E$5=$AD$12),\"cfm/ft\",\"\"))","v":"cfm/ft"},{"$f":"IF(OR($E$5=$AD$5,$E$5=$AD$6,$E$5=$AD$7,$E$5=$AD$8),300,IF(OR($E$5=$AD$9,$E$5=$AD$10,$E$5=$AD$11,$E$5=$AD$12),300*0.5875,\"\"))","v":176.25},{"$f":"IF(OR($E$5=$AD$5,$E$5=$AD$6,$E$5=$AD$7,$E$5=$AD$8),\"m³/(h*m)\",IF(OR($E$5=$AD$9,$E$5=$AD$10,$E$5=$AD$11,$E$5=$AD$12),\"cfm\",\"\"))","v":"cfm"},"78,00 in",{"$f":"IF((ROUNDUP($L$6/(G34*AC34/1000),0))=0,1,ROUNDUP($L$6/(G34*AC34/1000),0))","v":2},{"$f":"IF(OR($E$5=$AD$5,$E$5=$AD$6,$E$5=$AD$7,$E$5=$AD$8),AC34*L34/1000,IF(OR($E$5=$AD$9,$E$5=$AD$10,$E$5=$AD$11,$E$5=$AD$12),AC34*L34/1000*3.28084))","v":13.12336},{"$f":"IF(OR($E$5=$AD$5,$E$5=$AD$6,$E$5=$AD$7,$E$5=$AD$8),\"m\",IF(OR($E$5=$AD$9,$E$5=$AD$10,$E$5=$AD$11,$E$5=$AD$12),\"ft\",\"\"))","v":"ft"},{"$f":"ROUND(0.705*EXP(0.0677*AD34),0)","v":7},{"$f":"IF(OR($E$5=$AD$5,$E$5=$AD$6,$E$5=$AD$7,$E$5=$AD$8),AO34,IF(OR($E$5=$AD$9,$E$5=$AD$10,$E$5=$AD$11,$E$5=$AD$12),AO34*3.28084))","v":15.419948},{"$f":"IF(OR($E$5=$AD$5,$E$5=$AD$6,$E$5=$AD$7,$E$5=$AD$8),\"m\",IF(OR($E$5=$AD$9,$E$5=$AD$10,$E$5=$AD$11,$E$5=$AD$12),\"ft\",\"\"))","v":"ft"},{"$f":"IF(OR($E$5=$AD$5,$E$5=$AD$6,$E$5=$AD$7,$E$5=$AD$8),AZ34,IF(OR($E$5=$AD$9,$E$5=$AD$10,$E$5=$AD$11,$E$5=$AD$12),AZ34*3.28084))","v":0.7217848},{"$f":"IF(OR($E$5=$AD$5,$E$5=$AD$6,$E$5=$AD$7,$E$5=$AD$8),\"m/s\",IF(OR($E$5=$AD$9,$E$5=$AD$10,$E$5=$AD$11,$E$5=$AD$12),\"ft/s\",\"\"))","v":"ft/s"},{"$f":"IF(OR($E$5=$AD$5,$E$5=$AD$6,$E$5=$AD$7,$E$5=$AD$8),ROUND(((34-$L$7)*((IF(AZ34<0.05,0.05,AZ34)-0.05)^0.62)*((0.37*IF(AZ34<0.05,0.05,AZ34)*40)+3.14)),0),IF(OR($E$5=$AD$9,$E$5=$AD$10,$E$5=$AD$11,$E$5=$AD$12),ROUND(((34-(($L$7-32)/1.8))*((IF(AZ34<0.05,0.05,AZ34)-0.05)^0.62)*((0.37*IF(AZ34<0.05,0.05,AZ34)*40)+3.14)),0)))","v":17},{"$f":"IF(T34<10,\"A\",IF(T34<20,\"B\",IF(T34<30,\"C\",\"keine\")))","v":"B"},{"$f":"ROUNDDOWN(IF(BU34<15,15,BU34),1)","v":36.299999999999997},2313,"cfm",{"$f":"ROUNDDOWN(10*LOG(L34*10^(0.1*V34))-$L$9,1)","v":32.9},null,null,null,2000,{"$f":"IF(OR($E$5=$AD$5,$E$5=$AD$6,$E$5=$AD$7,$E$5=$AD$8),+(LN(G34)-LN(87.631))/0.0366,IF(OR($E$5=$AD$9,$E$5=$AD$10,$E$5=$AD$11,$E$5=$AD$12),+(LN(G34/0.5875)-LN(87.631))/0.0366))","v":33.624252951817695},{"$f":"0.5027*EXP(0.0724*$AD$34)","v":5.7352664247339069},{"$f":"+AE34+(AH34-AE34)/3","v":5.1950908886239384},{"$f":"+(AF34+AH34)/2","v":4.654915352513969},{"$f":"0.3174*EXP(0.0762*$AD$34)","v":4.1147398164040005},{"$f":"+(AH34+AJ34)/2","v":3.8736020292119275},{"$f":"+(AH34+AL34)/2","v":3.6324642420198545},{"$f":"+(AJ34+AL34)/2","v":3.3913264548277815},{"$f":"0.1882*EXP(0.0838*$AD$34)","v":3.1501886676357085},{"$f":"+(AL34+AN34)/2","v":2.9090508804436355},{"$f":"+AL34+AL34-AJ34","v":2.6679130932515625},{"$f":"ROUND(HLOOKUP($AC$16,$AE$18:$AN$38,17,FALSE),1)","v":4.7},{"$f":"0.005*($AD$34)^2-0.105*$AD$34+15.525","v":17.647405372898248},{"$f":"AR34-(AR34-AP34)/2","v":19.910396977742209},{"$f":"AS34-(AS34-AP34)/3","v":22.173388582586174},{"$f":"0.0214*($AD$34)^2-0.6471*$AD$34+22","v":24.436380187430139},{"$f":"AU34-(AU34-AS34)/2","v":24.723335430584044},{"$f":"0.0229*($AD$34)^2-0.8143*$AD$34+26.5","v":25.010290673737952},{"$f":"+AU34+AU34-AT34","v":25.29724591689186},{"$f":"+AV34+AV34-AU34","v":25.584201160045769},25.871156403199677,26.158111646353586,{"$f":"ROUND(HLOOKUP($AC$16,$AP$18:$AY$38,17,FALSE)/100,2)","v":0.22},{"$f":"IF(AC34<=$BB$18,BB34,IF(AND(AC34>$BB$18,AC34<=$BC$18),BC34,IF(AND(AC34>$BC$18,AC34<=$BD$18),BD34,IF(AND(AC34>$BD$18,AC34<=$BE$18),BE34,IF(AND(AC34>$BE$18,AC34<=$BF$18),BF34,IF(AND(AC34>$BF$18,AC34<=$BG$18),BG34,IF(AND(AC34>$BG$18,AC34<=$BH$18),BH34,IF(AC34>$BH$18,BH34))))))))","v":4},1,1,2,2,3,3,4,{"$f":"IF(AC34<=$BJ$18,BJ34,IF(AND(AC34>$BJ$18,AC34<=$BK$18),BK34,IF(AND(AC34>$BK$18,AC34<=$BL$18),BL34,IF(AND(AC34>$BL$18,AC34<=$BM$18),BM34,IF(AND(AC34>$BM$18,AC34<=$BN$18),BN34,IF(AND(AC34>$BN$18,AC34<=$BO$18),BO34,IF(AND(AC34>$BO$18,AC34<=$BP$18),BP34,IF(AC34>$BP$18,BP34))))))))","v":140},140,140,140,140,140,140,140,{"$f":"IF(OR($E$5=$AD$5,$E$5=$AD$6,$E$5=$AD$7,$E$5=$AD$8),G34,IF(OR($E$5=$AD$9,$E$5=$AD$10,$E$5=$AD$11,$E$5=$AD$12),G34/0.5875))","v":300},{"$f":"+IF(AD34<0,0,AD34)","v":33.624252951817695},{"$f":"(-0.000023788293*BI34^3 + 0.006551313626*BI34^2 - 0.573673222638*BI34 + 42.996345567831)*LN((BQ34*(AC34/1000))/BA34)+(0.000099312149*BI34^3 - 0.024864140926*BI34^2 + 1.505393168403*BI34 - 101.04319263046)+10*LOG(BA34)","v":30.246179298470679},{"$f":" 62.1456597122*LOG(BQ34) -121.8124227521+10*LOG(AC34/1000)","v":35.140211766205866},{"$f":"10*LOG(10^(0.1*BS34)+10^(0.1*BT34))","v":36.359218244831474},"LDB classic/4","DLU","0°",{"$f":"IF(OR($E$5=$AD$5,$E$5=$AD$6,$E$5=$AD$7,$E$5=$AD$8),G34*(AC34/1000),((G34*0.5875)*(AC34/1000))*0.5875)","v":121.66757812500001}]
[null,null,null,null,null,null,null,null,null,null,null,null,null,null,null,null,null,null,null,null,null,null,null,null,null,null,null,null,null,null,null,null,null,null,null,null,null,null,null,null,null,null,null,null,null,null,null,null,null,null,null,null,null,300,600,900,1200,1500,1800,2100,null,300,600,900,1200,1500,1800,2100]
[null,null,null,null,{"$f":"IF($E$4=$AC$3,Legende!A25,IF($E$4=$AC$4,Legende!B25,IF($E$4=$AC$5,Legende!C25,IF($E$4=$AC$6,Legende!D25))))","v":"LDB 50 maxx"},{"$f":"IF($E$4=$AC$3,Legende!A26,IF($E$4=$AC$4,Legende!B26,IF($E$4=$AC$5,Legende!C26,IF($E$4=$AC$6,Legende!D26))))","v":"1-slot"},164.5,{"$f":"IF(OR($E$5=$AD$5,$E$5=$AD$6,$E$5=$AD$7,$E$5=$AD$8),\"m³/(h*m)\",IF(OR($E$5=$AD$9,$E$5=$AD$10,$E$5=$AD$11,$E$5=$AD$12),\"cfm/ft\",\"\"))","v":"cfm/ft"},{"$f":"IF(OR($E$5=$AD$5,$E$5=$AD$6,$E$5=$AD$7,$E$5=$AD$8),280,IF(OR($E$5=$AD$9,$E$5=$AD$10,$E$5=$AD$11,$E$5=$AD$12),280*0.5875,\"\"))","v":164.5},{"$f":"IF(OR($E$5=$AD$5,$E$5=$AD$6,$E$5=$AD$7,$E$5=$AD$8),\"m³/(h*m)\",IF(OR($E$5=$AD$9,$E$5=$AD$10,$E$5=$AD$11,$E$5=$AD$12),\"cfm\",\"\"))","v":"cfm"},"81,90 in",{"$f":"IF((ROUNDUP($L$6/(G36*AC36/1000),0))=0,1,ROUNDUP($L$6/(G36*AC36/1000),0))","v":2},{"$f":"IF(OR($E$5=$AD$5,$E$5=$AD$6,$E$5=$AD$7,$E$5=$AD$8),AC36*L36/1000,IF(OR($E$5=$AD$9,$E$5=$AD$10,$E$5=$AD$11,$E$5=$AD$12),AC36*L36/1000*3.28084))","v":13.779528000000001},{"$f":"IF(OR($E$5=$AD$5,$E$5=$AD$6,$E$5=$AD$7,$E$5=$AD$8),\"m\",IF(OR($E$5=$AD$9,$E$5=$AD$10,$E$5=$AD$11,$E$5=$AD$12),\"ft\",\"\"))","v":"ft"},{"$f":"ROUND(1.6546*EXP(0.066*AD36),0)","v":15},{"$f":"IF(OR($E$5=$AD$5,$E$5=$AD$6,$E$5=$AD$7,$E$5=$AD$8),AO36,IF(OR($E$5=$AD$9,$E$5=$AD$10,$E$5=$AD$11,$E$5=$AD$12),AO36*3.28084))","v":16.404199999999999},{"$f":"IF(OR($E$5=$AD$5,$E$5=$AD$6,$E$5=$AD$7,$E$5=$AD$8),\"m\",IF(OR($E$5=$AD$9,$E$5=$AD$10,$E$5=$AD$11,$E$5=$AD$12),\"ft\",\"\"))","v":"ft"},{"$f":"IF(OR(AND($E$5=$AD$5,$E$5=$AD$6,$E$5=$AD$7,$E$5=$AD$8),AZ36<>\"-\"),AZ36,IF(OR(AND($E$5=$AD$9,$E$5=$AD$10,$E$5=$AD$11,$E$5=$AD$12),AZ36<>\"-\"),AZ36*3.28084,\"-\"))","v":0.22},{"$f":"IF(AND(OR($E$5=$AD$5,$E$5=$AD$6,$E$5=$AD$7,$E$5=$AD$8),R36<>\"-\"),\"m/s\",IF(AND(OR($E$5=$AD$9,$E$5=$AD$10,$E$5=$AD$11,$E$5=$AD$12),R36<>\"-\"),\"ft/s\",\"\"))","v":"ft/s"},{"$f":"IF(AZ36=\"-\",\"-\",IF(OR($E$5=$AD$5,$E$5=$AD$6,$E$5=$AD$7,$E$5=$AD$8),ROUND(((34-$L$7)*((IF(AZ36<0.05,0.05,AZ36)-0.05)^0.62)*((0.37*IF(AZ36<0.05,0.05,AZ36)*40)+3.14)),0),IF(OR($E$5=$AD$9,$E$5=$AD$10,$E$5=$AD$11,$E$5=$AD$12),ROUND(((34-(($L$7-32)/1.8))*((IF(AZ36<0.05,0.05,AZ36)-0.05)^0.62)*((0.37*IF(AZ36<0.05,0.05,AZ36)*40)+3.14)),0))))","v":17},{"$f":"IF(T36=\"-\",\"-\",IF(T36<10,\"A\",IF(T36<20,\"B\",IF(T36<30,\"C\",\"keine\"))))","v":"B"},{"$f":"ROUNDDOWN(IF(BU36<15,15,BU36),1)","v":36.9},2267,"cfm",{"$f":"ROUNDDOWN(10*LOG(L36*10^(0.1*V36))-$L$9,1)","v":33.5},null,null,null,2100,{"$f":"IF(OR($E$5=$AD$5,$E$5=$AD$6,$E$5=$AD$7,$E$5=$AD$8),+(LN(G36)-LN(91.69))/0.0331,IF(OR($E$5=$AD$9,$E$5=$AD$10,$E$5=$AD$11,$E$5=$AD$12),+(LN(G36/0.5875)-LN(91.69))/0.0331))","v":33.72738009388037},{"$f":"+((AF36-(AH36-AF36))+AF36)/2","v":5.9758188839093176},{"$f":"3.107*EXP(0.0169*$AD$36)","v":5.4939657522930334},{"$f":"+(AF36+AH36)/2","v":5.0121126206767492},{"$f":"2.3469*EXP(0.0195*$AD$36)","v":4.5302594890604651},{"$f":"+(AH36+AJ36)/2","v":4.3263634581118922},{"$f":"+(AH36+AL36)/2","v":4.1224674271633193},3.9185713962147464,{"$f":"1.7392*EXP(0.0225*$AD$36)","v":3.7146753652661735},{"$f":"+(AL36+AN36)/2","v":3.5107793343176006},{"$f":"+AL36+AL36-AJ36","v":3.3068833033690277},{"$f":"ROUND(HLOOKUP($AC$16,$AE$18:$AN$38,19,FALSE),1)","v":5},{"$f":"+AS36-(AV36-AS36)","v":23.507413306795215},{"$f":"+(AR36+AP36)/2","v":22.79459370669187},{"$f":"+AS36-(AT36-AS36)","v":22.081774106588526},{"$f":"9.6405*EXP(0.0236*$AD$36)","v":21.368954506485185},{"$f":"AU36-(AU36-AS36)/2","v":20.656134906381844},{"$f":"AV36-(AV36-AS36)/3","v":19.9433153062785},{"$f":"AW36-(AW36-AS36)/4","v":19.230495706175155},{"$f":"0.0086*($AD$36)^2-0.0714*$AD$36+11.143","v":18.517676106071811},"-","-",{"$f":"IF(HLOOKUP($AC$16,$AP$18:$AY$38,19,FALSE)=\"-\",\"-\",ROUND(HLOOKUP($AC$16,$AP$18:$AY$38,19,FALSE)/100,2))","v":0.22},{"$f":"IF(AC36<=$BB$35,BB36,IF(AND(AC36>$BB$35,AC36<=$BC$35),BC36,IF(AND(AC36>$BC$35,AC36<=$BD$35),BD36,IF(AND(AC36>$BD$35,AC36<=$BE$35),BE36,IF(AND(AC36>$BE$35,AC36<=$BF$35),BF36,IF(AND(AC36>$BF$35,AC36<=$BG$35),BG36,IF(AND(AC36>$BG$35,AC36<=$BH$35),BH36,IF(AC36>$BH$35,BH36))))))))","v":3},1,1,2,2,3,3,3,{"$f":"IF(AC36<=$BJ$35,BJ36,IF(AND(AC36>$BJ$35,AC36<=$BK$35),BK36,IF(AND(AC36>$BK$35,AC36<=$BL$35),BL36,IF(AND(AC36>$BL$35,AC36<=$BM$35),BM36,IF(AND(AC36>$BM$35,AC36<=$BN$35),BN36,IF(AND(AC36>$BN$35,AC36<=$BO$35),BO36,IF(AND(AC36>$BO$35,AC36<=$BP$35),BP36,IF(AC36>$BP$35,BP36))))))))","v":200},200,200,200,200,200,200,200,{"$f":"IF(OR($E$5=$AD$5,$E$5=$AD$6,$E$5=$AD$7,$E$5=$AD$8),G36,IF(OR($E$5=$AD$9,$E$5=$AD$10,$E$5=$AD$11,$E$5=$AD$12),G36/0.5875))","v":280},{"$f":"+IF(AD36<0,0,AD36)","v":33.72738009388037},null,null,{"$f":"10*LOG((AC36/1000)*10^(0.1*BR36))","v":36.949573041219566},"LDB maxx/1","SDA","-",{"$f":"IF(OR($E$5=$AD$5,$E$5=$AD$6,$E$5=$AD$7,$E$5=$AD$8),G36*(AC36/1000),((G36*0.5875)*(AC36/1000))*0.5875)","v":119.2342265625}]
[null,null,null,null,{"$f":"IF($E$4=$AC$3,Legende!A25,IF($E$4=$AC$4,Legende!B25,IF($E$4=$AC$5,Legende!C25,IF($E$4=$AC$6,Legende!D25))))","v":"LDB 50 maxx"},{"$f":"IF($E$4=$AC$3,Legende!A27,IF($E$4=$AC$4,Legende!B27,IF($E$4=$AC$5,Legende!C27,IF($E$4=$AC$6,Legende!D27))))","v":"2-slot"},246.75,{"$f":"IF(OR($E$5=$AD$5,$E$5=$AD$6,$E$5=$AD$7,$E$5=$AD$8),\"m³/(h*m)\",IF(OR($E$5=$AD$9,$E$5=$AD$10,$E$5=$AD$11,$E$5=$AD$12),\"cfm/ft\",\"\"))","v":"cfm/ft"},{"$f":"IF(OR($E$5=$AD$5,$E$5=$AD$6,$E$5=$AD$7,$E$5=$AD$8),650,IF(OR($E$5=$AD$9,$E$5=$AD$10,$E$5=$AD$11,$E$5=$AD$12),650*0.5875,\"\"))","v":381.875},{"$f":"IF(OR($E$5=$AD$5,$E$5=$AD$6,$E$5=$AD$7,$E$5=$AD$8),\"m³/(h*m)\",IF(OR($E$5=$AD$9,$E$5=$AD$10,$E$5=$AD$11,$E$5=$AD$12),\"cfm\",\"\"))","v":"cfm"},"58,50 in",{"$f":"IF((ROUNDUP($L$6/(G37*AC37/1000),0))=0,1,ROUNDUP($L$6/(G37*AC37/1000),0))","v":2},{"$f":"IF(OR($E$5=$AD$5,$E$5=$AD$6,$E$5=$AD$7,$E$5=$AD$8),AC37*L37/1000,IF(OR($E$5=$AD$9,$E$5=$AD$10,$E$5=$AD$11,$E$5=$AD$12),AC37*L37/1000*3.28084))","v":9.8425200000000004},{"$f":"IF(OR($E$5=$AD$5,$E$5=$AD$6,$E$5=$AD$7,$E$5=$AD$8),\"m\",IF(OR($E$5=$AD$9,$E$5=$AD$10,$E$5=$AD$11,$E$5=$AD$12),\"ft\",\"\"))","v":"ft"},{"$f":"ROUND(1.4423*EXP(0.0638*AD37),0)","v":14},{"$f":"IF(OR($E$5=$AD$5,$E$5=$AD$6,$E$5=$AD$7,$E$5=$AD$8),AO37,IF(OR($E$5=$AD$9,$E$5=$AD$10,$E$5=$AD$11,$E$5=$AD$12),AO37*3.28084))","v":15.748031999999998},{"$f":"IF(OR($E$5=$AD$5,$E$5=$AD$6,$E$5=$AD$7,$E$5=$AD$8),\"m\",IF(OR($E$5=$AD$9,$E$5=$AD$10,$E$5=$AD$11,$E$5=$AD$12),\"ft\",\"\"))","v":"ft"},{"$f":"IF(OR(AND($E$5=$AD$5,$E$5=$AD$6,$E$5=$AD$7,$E$5=$AD$8),AZ37<>\"-\"),AZ37,IF(OR(AND($E$5=$AD$9,$E$5=$AD$10,$E$5=$AD$11,$E$5=$AD$12),AZ37<>\"-\"),AZ37*3.28084,\"-\"))","v":0.21},{"$f":"IF(AND(OR($E$5=$AD$5,$E$5=$AD$6,$E$5=$AD$7,$E$5=$AD$8),R37<>\"-\"),\"m/s\",IF(AND(OR($E$5=$AD$9,$E$5=$AD$10,$E$5=$AD$11,$E$5=$AD$12),R37<>\"-\"),\"ft/s\",\"\"))","v":"ft/s"},{"$f":"IF(AZ37=\"-\",\"-\",IF(OR($E$5=$AD$5,$E$5=$AD$6,$E$5=$AD$7,$E$5=$AD$8),ROUND(((34-$L$7)*((IF(AZ37<0.05,0.05,AZ37)-0.05)^0.62)*((0.37*IF(AZ37<0.05,0.05,AZ37)*40)+3.14)),0),IF(OR($E$5=$AD$9,$E$5=$AD$10,$E$5=$AD$11,$E$5=$AD$12),ROUND(((34-(($L$7-32)/1.8))*((IF(AZ37<0.05,0.05,AZ37)-0.05)^0.62)*((0.37*IF(AZ37<0.05,0.05,AZ37)*40)+3.14)),0))))","v":16},{"$f":"IF(T37=\"-\",\"-\",IF(T37<10,\"A\",IF(T37<20,\"B\",IF(T37<30,\"C\",\"keine\"))))","v":"B"},{"$f":"ROUNDDOWN(IF(BU37<15,15,BU37),1)","v":37.299999999999997},2429,"cfm",{"$f":"ROUNDDOWN(10*LOG(L37*10^(0.1*V37))-$L$9,1)","v":33.9},null,null,null,1500,{"$f":"IF(OR($E$5=$AD$5,$E$5=$AD$6,$E$5=$AD$7,$E$5=$AD$8),+(LN(G37)-LN(134.77))/0.0319,IF(OR($E$5=$AD$9,$E$5=$AD$10,$E$5=$AD$11,$E$5=$AD$12),+(LN(G37/0.5875)-LN(134.77))/0.0319))","v":35.632761426217755},{"$f":"AF37+(AF37-AG37)","v":5.5803116912534829},{"$f":"2.8219*EXP(0.0171*$AD$37)","v":5.1899841194141736},{"$f":"+(AF37+AH37)/2","v":4.7996565475748643},{"$f":"2.2485*EXP(0.0189*$AD$37)","v":4.4093289757355558},4.231663257194219,{"$f":"+(AH37+AL37)/2","v":4.0539975386528821},3.8763318201115453,{"$f":"1.7131*EXP(0.0216*$AD$37)","v":3.6986661015702085},{"$f":"+(AL37+AN37)/2","v":3.5210003830288716},{"$f":"+AL37+AL37-AJ37","v":3.3433346644875348},{"$f":"ROUND(HLOOKUP($AC$16,$AE$18:$AN$38,20,FALSE),1)","v":4.8},{"$f":"+AQ37-(AR37-AQ37)","v":16.080417402045793},{"$f":"+AS37-(AU37-AS37)","v":18.414678234687159},{"$f":"+AS37+(AS37-AT37)","v":20.748939067328525},{"$f":"10.428*EXP(0.0223*$AD$37)","v":23.083199899969891},{"$f":"AU37-(AU37-AS37)/2","v":25.417460732611257},{"$f":"0.03*($AD$37)^2-1.01*$AD$37+25.65","v":27.751721565252623},"-","-","-","-",{"$f":"IF(HLOOKUP($AC$16,$AP$18:$AY$38,20,FALSE)=\"-\",\"-\",ROUND(HLOOKUP($AC$16,$AP$18:$AY$38,20,FALSE)/100,2))","v":0.21},{"$f":"IF(AC37<=$BB$35,BB37,IF(AND(AC37>$BB$35,AC37<=$BC$35),BC37,IF(AND(AC37>$BC$35,AC37<=$BD$35),BD37,IF(AND(AC37>$BD$35,AC37<=$BE$35),BE37,IF(AND(AC37>$BE$35,AC37<=$BF$35),BF37,IF(AND(AC37>$BF$35,AC37<=$BG$35),BG37,IF(AND(AC37>$BG$35,AC37<=$BH$35),BH37,IF(AC37>$BH$35,BH37))))))))","v":3},1,1,2,2,3,3,4,{"$f":"IF(AC37<=$BJ$35,BJ37,IF(AND(AC37>$BJ$35,AC37<=$BK$35),BK37,IF(AND(AC37>$BK$35,AC37<=$BL$35),BL37,IF(AND(AC37>$BL$35,AC37<=$BM$35),BM37,IF(AND(AC37>$BM$35,AC37<=$BN$35),BN37,IF(AND(AC37>$BN$35,AC37<=$BO$35),BO37,IF(AND(AC37>$BO$35,AC37<=$BP$35),BP37,IF(AC37>$BP$35,BP37))))))))","v":200},200,200,200,200,200,200,200,{"$f":"IF(OR($E$5=$AD$5,$E$5=$AD$6,$E$5=$AD$7,$E$5=$AD$8),G37,IF(OR($E$5=$AD$9,$E$5=$AD$10,$E$5=$AD$11,$E$5=$AD$12),G37/0.5875))","v":420},{"$f":"+IF(AD37<0,0,AD37)","v":35.632761426217755},null,null,{"$f":"10*LOG((AC37/1000)*10^(0.1*BR37))","v":37.393674016774575},"LDB maxx/2","SDA","-",{"$f":"IF(OR($E$5=$AD$5,$E$5=$AD$6,$E$5=$AD$7,$E$5=$AD$8),G37*(AC37/1000),((G37*0.5875)*(AC37/1000))*0.5875)","v":127.75095703125001}]
[null,null,null,null,{"$f":"IF($E$4=$AC$3,Legende!A25,IF($E$4=$AC$4,Legende!B25,IF($E$4=$AC$5,Legende!C25,IF($E$4=$AC$6,Legende!D25))))","v":"LDB 50 maxx"},{"$f":"IF($E$4=$AC$3,Legende!A28,IF($E$4=$AC$4,Legende!B28,IF($E$4=$AC$5,Legende!C28,IF($E$4=$AC$6,Legende!D28))))","v":"3-slot"},287.875,{"$f":"IF(OR($E$5=$AD$5,$E$5=$AD$6,$E$5=$AD$7,$E$5=$AD$8),\"m³/(h*m)\",IF(OR($E$5=$AD$9,$E$5=$AD$10,$E$5=$AD$11,$E$5=$AD$12),\"cfm/ft\",\"\"))","v":"cfm/ft"},{"$f":"IF(OR($E$5=$AD$5,$E$5=$AD$6,$E$5=$AD$7,$E$5=$AD$8),800,IF(OR($E$5=$AD$9,$E$5=$AD$10,$E$5=$AD$11,$E$5=$AD$12),800*0.5875,\"\"))","v":470},{"$f":"IF(OR($E$5=$AD$5,$E$5=$AD$6,$E$5=$AD$7,$E$5=$AD$8),\"m³/(h*m)\",IF(OR($E$5=$AD$9,$E$5=$AD$10,$E$5=$AD$11,$E$5=$AD$12),\"cfm\",\"\"))","v":"cfm"},"58,50 in",{"$f":"IF((ROUNDUP($L$6/(G38*AC38/1000),0))=0,1,ROUNDUP($L$6/(G38*AC38/1000),0))","v":2},{"$f":"IF(OR($E$5=$AD$5,$E$5=$AD$6,$E$5=$AD$7,$E$5=$AD$8),AC38*L38/1000,IF(OR($E$5=$AD$9,$E$5=$AD$10,$E$5=$AD$11,$E$5=$AD$12),AC38*L38/1000*3.28084))","v":9.8425200000000004},{"$f":"IF(OR($E$5=$AD$5,$E$5=$AD$6,$E$5=$AD$7,$E$5=$AD$8),\"m\",IF(OR($E$5=$AD$9,$E$5=$AD$10,$E$5=$AD$11,$E$5=$AD$12),\"ft\",\"\"))","v":"ft"},{"$f":"ROUND(0.4739*EXP(0.0789*AD38),0)","v":9},{"$f":"IF(OR($E$5=$AD$5,$E$5=$AD$6,$E$5=$AD$7,$E$5=$AD$8),AO38,IF(OR($E$5=$AD$9,$E$5=$AD$10,$E$5=$AD$11,$E$5=$AD$12),AO38*3.28084))","v":13.12336},{"$f":"IF(OR($E$5=$AD$5,$E$5=$AD$6,$E$5=$AD$7,$E$5=$AD$8),\"m\",IF(OR($E$5=$AD$9,$E$5=$AD$10,$E$5=$AD$11,$E$5=$AD$12),\"ft\",\"\"))","v":"ft"},{"$f":"IF(OR(AND($E$5=$AD$5,$E$5=$AD$6,$E$5=$AD$7,$E$5=$AD$8),AZ38<>\"-\"),AZ38,IF(OR(AND($E$5=$AD$9,$E$5=$AD$10,$E$5=$AD$11,$E$5=$AD$12),AZ38<>\"-\"),AZ38*3.28084,\"-\"))","v":0.22},{"$f":"IF(AND(OR($E$5=$AD$5,$E$5=$AD$6,$E$5=$AD$7,$E$5=$AD$8),R38<>\"-\"),\"m/s\",IF(AND(OR($E$5=$AD$9,$E$5=$AD$10,$E$5=$AD$11,$E$5=$AD$12),R38<>\"-\"),\"ft/s\",\"\"))","v":"ft/s"},17,{"$f":"IF(T38=\"-\",\"-\",IF(T38<10,\"A\",IF(T38<20,\"B\",IF(T38<30,\"C\",\"keine\"))))","v":"B"},{"$f":"ROUNDDOWN(IF(BU38<15,15,BU38),1)","v":38.299999999999997},2833,"cfm",{"$f":"ROUNDDOWN(10*LOG(L38*10^(0.1*V38))-$L$9,1)","v":34.9},null,null,null,1500,{"$f":"IF(OR($E$5=$AD$5,$E$5=$AD$6,$E$5=$AD$7,$E$5=$AD$8),+(LN(G38)-LN(126.5))/0.037,IF(OR($E$5=$AD$9,$E$5=$AD$10,$E$5=$AD$11,$E$5=$AD$12),+(LN(G38/0.5875)-LN(126.5))/0.037))","v":36.599002241543161},{"$f":"AF38+(AF38-AG38)","v":4.7019572970148555},{"$f":"2.1117*EXP(0.0198*$AD$38)","v":4.3586115494468292},{"$f":"+(AF38+AH38)/2","v":4.0152658018788028},{"$f":"1.6595*EXP(0.0217*$AD$38)","v":3.6719200543107768},3.546496265164822,{"$f":"+(AH38+AL38)/2","v":3.4210724760188671},3.2956486868729122,{"$f":"1.2152*EXP(0.0262*$AD$38)","v":3.1702248977269574},{"$f":"+(AL38+AN38)/2","v":3.0448011085810025},{"$f":"+AL38+AL38-AJ38","v":2.9193773194350476},{"$f":"ROUND(HLOOKUP($AC$16,$AE$18:$AN$38,21,FALSE),1)","v":4},{"$f":"+AQ38-(AR38-AQ38)","v":14.875878488817399},{"$f":"0.0057*($AD$38)^2-0.1829*$AD$38+17.257","v":18.1981181909577},{"$f":"AS38-(AS38-AQ38)/2","v":21.520357893098002},{"$f":"0.0014*($AD$38)^2+0.0643*$AD$38+20.614","v":24.842597595238299},{"$f":"+(AU38+AS38)/2","v":28.164837297378597},{"$f":"+AS38+AS38-AQ38","v":31.487076999518898},"-","-","-","-",{"$f":"IF(HLOOKUP($AC$16,$AP$18:$AY$38,21,FALSE)=\"-\",\"-\",ROUND(HLOOKUP($AC$16,$AP$18:$AY$38,21,FALSE)/100,2))","v":0.22},{"$f":"IF(AC38<=$BB$35,BB38,IF(AND(AC38>$BB$35,AC38<=$BC$35),BC38,IF(AND(AC38>$BC$35,AC38<=$BD$35),BD38,IF(AND(AC38>$BD$35,AC38<=$BE$35),BE38,IF(AND(AC38>$BE$35,AC38<=$BF$35),BF38,IF(AND(AC38>$BF$35,AC38<=$BG$35),BG38,IF(AND(AC38>$BG$35,AC38<=$BH$35),BH38,IF(AC38>$BH$35,BH38))))))))","v":3},1,1,2,2,3,3,4,{"$f":"IF(AC38<=$BJ$35,BJ38,IF(AND(AC38>$BJ$35,AC38<=$BK$35),BK38,IF(AND(AC38>$BK$35,AC38<=$BL$35),BL38,IF(AND(AC38>$BL$35,AC38<=$BM$35),BM38,IF(AND(AC38>$BM$35,AC38<=$BN$35),BN38,IF(AND(AC38>$BN$35,AC38<=$BO$35),BO38,IF(AND(AC38>$BO$35,AC38<=$BP$35),BP38,IF(AC38>$BP$35,BP38))))))))","v":200},200,200,200,200,200,200,200,{"$f":"IF(OR($E$5=$AD$5,$E$5=$AD$6,$E$5=$AD$7,$E$5=$AD$8),G38,IF(OR($E$5=$AD$9,$E$5=$AD$10,$E$5=$AD$11,$E$5=$AD$12),G38/0.5875))","v":490},{"$f":"+IF(AD38<0,0,AD38)","v":36.599002241543161},null,null,{"$f":"10*LOG((AC38/1000)*10^(0.1*BR38))","v":38.359914832099982},"LDB maxx/3","SDA","-",{"$f":"IF(OR($E$5=$AD$5,$E$5=$AD$6,$E$5=$AD$7,$E$5=$AD$8),G38*(AC38/1000),((G38*0.5875)*(AC38/1000))*0.5875)","v":149.04278320312503}]
[]
[null,null,null,{"$f":"IF($E$4=$AC$3,Legende!A72,IF($E$4=$AC$4,Legende!B72,IF($E$4=$AC$5,Legende!C72,IF($E$4=$AC$6,Legende!D72))))","v":"© LTG Aktiengesellschaft: 28.07.2021 - LES - V1.5"}]
[null,null,null,{"$f":"IF($E$4=$AC$3,Legende!A73,IF($E$4=$AC$4,Legende!B73,IF($E$4=$AC$5,Legende!C73,IF($E$4=$AC$6,Legende!D73))))","v":"Information on tolerances and other specifications can be found in the current technical documentation."}]
[null,null,null,{"$f":"IF($E$4=$AC$3,Legende!A74,IF($E$4=$AC$4,Legende!B74,IF($E$4=$AC$5,Legende!C74,IF($E$4=$AC$6,Legende!D74))))","v":"You can find this at www.LTG.de. We cannot guarantee that the program is free from errors."}]

{"sheet":"Raumabsorption","index":1,"n_rows":43,"n_cols":22,"rows_kept":43,"cut":false,"hidden":false,"merged":[[5,2,5,3],[5,4,5,5],[2,2,2,3],[2,4,2,5],[3,2,3,3],[3,4,3,5],[4,2,4,3],[4,4,4,5],[6,2,6,3],[6,4,6,5],[20,9,20,13],[26,3,26,5],[29,3,29,5],[23,3,23,5],[23,9,23,11],[24,9,24,11],[25,3,25,7],[20,3,20,7],[21,3,21,5],[21,9,21,11],[22,3,22,5],[22,9,22,11],[36,3,36,5],[37,3,37,5],[10,8,10,10],[12,8,12,10],[14,8,14,10],[31,3,31,5],[32,3,32,5],[33,3,33,5],[27,9,27,11],[28,9,28,11],[32,9,32,11],[12,11,12,12],[30,3,30,5],[31,9,31,11],[5,12,5,14],[6,12,6,14],[35,9,35,11],[36,9,36,11],[37,9,37,11],[14,11,14,12],[10,11,10,12]]}
[null,null,null,null,null,null,null,null,null,null,null,null,null,null,null,null,null,null,{"$f":"'LDB Übersicht'!$AC$3","v":"Deutsch"},{"$f":"'LDB Übersicht'!$AC$4","v":"English"},{"$f":"'LDB Übersicht'!$AC$5","v":"Francais"},{"$f":"'LDB Übersicht'!$AC$6","v":"Italiano"}]
[]
[null,null,{"$f":"'LDB Übersicht'!C7:D7","v":"Date:"},null,{"$f":"IF('LDB Übersicht'!E7:F7=\"\",\"\",'LDB Übersicht'!E7:F7)","v":"2021-07-29"},null,null,null,null,null,null,null,null,null,null,null,null,{"$f":"IF('LDB Übersicht'!$E$4='LDB Übersicht'!$AC$3,R$4,IF('LDB Übersicht'!$E$4='LDB Übersicht'!$AC$4,R$5,IF('LDB Übersicht'!$E$4='LDB Übersicht'!$AC$5,R$6,IF('LDB Übersicht'!$E$4='LDB Übersicht'!$AC$6,R$7))))","v":"back + accept"},"Gewählte Nachhallzeit:","Selected reverberation time:","Temps de réverbération sélectionné.","Tempo di riverbero selezionato."]
[null,null,{"$f":"'LDB Übersicht'!C8:D8","v":"Editor:"},null,{"$f":"IF('LDB Übersicht'!E8:F8=\"\",\"\",'LDB Übersicht'!E8:F8)","v":""},null,null,null,null,null,null,null,null,null,null,null,null,"Zurück + Übernehmen","Beispiele üblicher Nachhallzeiten nach VDI 2081-BI. 1 (2001)","Examples of common reverberation times according to VDI 2081-BI. 1 (2001)","Exemples de temps de réverbération courants selon VDI 2081-BI. 1 (2001)","Esempi di tempi di riverbero comuni secondo VDI 2081-BI. 1 (2001)"]
[null,null,{"$f":"'LDB Übersicht'!C9:D9","v":"Project:"},null,{"$f":"IF('LDB Übersicht'!E9:F9=\"\",\"\",'LDB Übersicht'!E9:F9)","v":""},null,null,null,null,null,null,null,null,null,null,null,null,"back + accept","Büro:","Office:","Bureau:","Ufficio:"]
[null,null,{"$f":"'LDB Übersicht'!C10:D10","v":"Variant:"},null,{"$f":"IF('LDB Übersicht'!E10:F10=\"\",\"\",'LDB Übersicht'!E10:F10)","v":""},null,null,null,null,null,null,null,"E-Mail: Info@LTG.de ",null,null,null,null,"Retour + Appliquer","Kleiner Büroraum:","Small office room:","Petit espace de bureau:","Piccolo spazio ufficio:"]
[null,null,{"$f":"'LDB Übersicht'!C11:D11","v":"Order number:"},null,{"$f":"IF('LDB Übersicht'!E11:F11=\"\",\"\",'LDB Übersicht'!E11:F11)","v":""},null,null,null,null,null,null,null,"Tel. +49 (0)711 8201-0",null,null,null,null,"indietro + accetta","Großraumbüro:","Open-plan office:","Bureau ouverts:","Ufficio open space:"]
[null,null,null,null,null,null,null,null,null,null,null,null,null,null,null,null,null,{"$f":"IF('LDB Übersicht'!$E$4='LDB Übersicht'!$AC$3,R$9,IF('LDB Übersicht'!$E$4='LDB Übersicht'!$AC$4,R$10,IF('LDB Übersicht'!$E$4='LDB Übersicht'!$AC$5,R$11,IF('LDB Übersicht'!$E$4='LDB Übersicht'!$AC$6,R$12))))","v":"Abort"},"Besprechungsraum:","Meeting room:","Salle de réunion:","Sala riunioni:"]
[null,null,null,null,{"$f":"IF('LDB Übersicht'!$E$4='LDB Übersicht'!$AC$3,Legende!A49,IF('LDB Übersicht'!$E$4='LDB Übersicht'!$AC$4,Legende!B49,IF('LDB Übersicht'!$E$4='LDB Übersicht'!$AC$5,Legende!C49,IF('LDB Übersicht'!$E$4='LDB Übersicht'!$AC$6,Legende!D49,\"\"))))","v":"Room dimensions:"},null,null,null,null,null,null,null,null,null,null,null,null,"Abbrechen","Wohngebäude:","Residential building:","Bâtiment résidentiel:","Edifici residenziali:"]
[null,null,null,null,null,null,null,null,null,null,null,null,null,null,null,null,null,"Abort","Wohn-/Schlafräume:","Living- and sleeping room:","Salon Chambre:","Camera da letto / soggiorno:"]
[null,null,null,null,{"$f":"IF('LDB Übersicht'!$E$4='LDB Übersicht'!$AC$3,Legende!A50,IF('LDB Übersicht'!$E$4='LDB Übersicht'!$AC$4,Legende!B50,IF('LDB Übersicht'!$E$4='LDB Übersicht'!$AC$5,Legende!C50,IF('LDB Übersicht'!$E$4='LDB Übersicht'!$AC$6,Legende!D50,\"\"))))","v":"Width:"},5,null,null,{"$f":"IF('LDB Übersicht'!$E$4='LDB Übersicht'!$AC$3,Legende!A55,IF('LDB Übersicht'!$E$4='LDB Übersicht'!$AC$4,Legende!B55,IF('LDB Übersicht'!$E$4='LDB Übersicht'!$AC$5,Legende!C55,IF('LDB Übersicht'!$E$4='LDB Übersicht'!$AC$6,Legende!D55,\"\"))))","v":"Room sound absorpion:"},null,null,{"$f":"IF((10*LOG10(0.163*((F11*F15*F13)/L15)/4))<0,0.001,(10*LOG10(0.163*((F11*F15*F13)/L15)/4)))","v":6.4009083645343869},null,null,null,null,null,"Avorter","Hotels:","Hotel:","Hôtels:","Hotels:"]
[null,null,null,null,null,null,null,null,null,null,null,null,null,null,null,null,null,"Interrompi","kleines Hotelzimmer (V < 40m³):","small Hotelroom (V > 40m^3):","petite chambre d'hôtel (V <40m³):","piccola stanza d'albergo (V <40m^3):"]
[null,null,null,null,{"$f":"IF('LDB Übersicht'!$E$4='LDB Übersicht'!$AC$3,Legende!A51,IF('LDB Übersicht'!$E$4='LDB Übersicht'!$AC$4,Legende!B51,IF('LDB Übersicht'!$E$4='LDB Übersicht'!$AC$5,Legende!C51,IF('LDB Übersicht'!$E$4='LDB Übersicht'!$AC$6,Legende!D51,\"\"))))","v":"Height:"},3,null,null,{"$f":"IF('LDB Übersicht'!$E$4='LDB Übersicht'!$AC$3,Legende!A54,IF('LDB Übersicht'!$E$4='LDB Übersicht'!$AC$4,Legende!B54,IF('LDB Übersicht'!$E$4='LDB Übersicht'!$AC$5,Legende!C54,IF('LDB Übersicht'!$E$4='LDB Übersicht'!$AC$6,Legende!D54,\"\"))))","v":"Equivalent absorption area:"},null,null,{"$f":"0.163*((F11*F13*F15)/L15)","v":17.464285714285715},null,null,null,null,null,null,"kleines Hotelzimmer (V > 40m³):","big Hotelroom (V > 40m^3):","petite chambre d'hôtel (V> 40m³):","grande camera d'albergo (V> 40 m^3):"]
[null,null,null,null,null,null,null,null,null,null,null,null,null,null,null,null,null,null,"Studios:","Studios:","Studios:","Studios:"]
[null,null,null,null,{"$f":"IF('LDB Übersicht'!$E$4='LDB Übersicht'!$AC$3,Legende!A52,IF('LDB Übersicht'!$E$4='LDB Übersicht'!$AC$4,Legende!B52,IF('LDB Übersicht'!$E$4='LDB Übersicht'!$AC$5,Legende!C52,IF('LDB Übersicht'!$E$4='LDB Übersicht'!$AC$6,Legende!D52,\"\"))))","v":"Depth:"},5,null,null,{"$f":"IF('LDB Übersicht'!$E$4='LDB Übersicht'!$AC$3,Legende!A53,IF('LDB Übersicht'!$E$4='LDB Übersicht'!$AC$4,Legende!B53,IF('LDB Übersicht'!$E$4='LDB Übersicht'!$AC$5,Legende!C53,IF('LDB Übersicht'!$E$4='LDB Übersicht'!$AC$6,Legende!D53,\"\"))))","v":"Selected reverberation period:"},null,null,0.7,null,null,null,null,null,0.5,"Rundfunkstudio:","Radio studio:","Studio de diffusion:","Studio Broadcasting:"]
[null,null,null,null,null,null,null,null,null,null,null,null,null,null,null,null,null,0.6,"Fernsehstudio:","TV studio:","Studio de télévision:","Studio televisivo:"]
[null,null,null,null,null,null,null,null,null,null,null,null,null,null,null,null,null,0.7,"Krankenhaus:","Hospital:","Hôpital:","Ospedale:"]
[null,null,null,{"$f":"IF('LDB Übersicht'!$E$4='LDB Übersicht'!$AC$3,Raumabsorption!S4,IF('LDB Übersicht'!$E$4='LDB Übersicht'!$AC$4,Raumabsorption!T4,IF('LDB Übersicht'!$E$4='LDB Übersicht'!$AC$5,Raumabsorption!U4,IF('LDB Übersicht'!$E$4='LDB Übersicht'!$AC$6,Raumabsorption!V4,\"\"))))","v":"Examples of common reverberation times according to VDI 2081-BI. 1 (2001)"},null,null,null,null,null,null,null,null,null,null,null,null,null,0.8,"Bettenzimmer:","Bedroom:","Chambre:","Camere da letto:"]
[null,null,null,{"$f":"IF('LDB Übersicht'!$E$4='LDB Übersicht'!$AC$3,Raumabsorption!S37,IF('LDB Übersicht'!$E$4='LDB Übersicht'!$AC$4,Raumabsorption!T37,IF('LDB Übersicht'!$E$4='LDB Übersicht'!$AC$5,Raumabsorption!U37,IF('LDB Übersicht'!$E$4='LDB Übersicht'!$AC$6,Raumabsorption!V37,\"\"))))","v":"Permissible A-weighting sound pressure level. Standard values ​​go to EN 13779"},null,null,null,null,null,null,null,null,null,null,null,null,null,0.9,"Hallen, Korridore:","Hall, Corridor:","Halls, couloirs:","Sale, corridoi:"]
[null,null,null,null,null,null,null,null,null,null,null,null,null,null,null,null,null,1,"Untersuchungsräume:","Medical inspection rooms:","Salles d'examen:","Sale di visita:"]
[null,null,null,{"$f":"IF('LDB Übersicht'!$E$4='LDB Übersicht'!$AC$3,Raumabsorption!S5,IF('LDB Übersicht'!$E$4=Raumabsorption!$T$1,Raumabsorption!T5,IF('LDB Übersicht'!$E$4=Raumabsorption!$U$1,Raumabsorption!U5,IF('LDB Übersicht'!$E$4=Raumabsorption!$V$1,Raumabsorption!V5,\"\"))))","v":"Office:"},null,null,null,null,null,{"$f":"IF('LDB Übersicht'!$E$4='LDB Übersicht'!$AC$3,Raumabsorption!S17,IF('LDB Übersicht'!$E$4='LDB Übersicht'!$AC$4,Raumabsorption!T17,IF('LDB Übersicht'!$E$4='LDB Übersicht'!$AC$5,Raumabsorption!U17,IF('LDB Übersicht'!$E$4='LDB Übersicht'!$AC$6,Raumabsorption!V17,\"\"))))","v":"Hospital:"},null,null,null,null,null,null,null,1.1000000000000001,"OP-Räume:","Operation rooms:","Salles d'opération:","Sale operatorie:"]
[null,null,null,{"$f":"IF('LDB Übersicht'!$E$4='LDB Übersicht'!$AC$3,Raumabsorption!S6,IF('LDB Übersicht'!$E$4='LDB Übersicht'!$AC$4,Raumabsorption!T6,IF('LDB Übersicht'!$E$4='LDB Übersicht'!$AC$5,Raumabsorption!U6,IF('LDB Übersicht'!$E$4='LDB Übersicht'!$AC$6,Raumabsorption!V6,\"\"))))","v":"Small office room:"},null,null,"0,5 s","35 dB(A)",null,{"$f":"IF('LDB Übersicht'!$E$4='LDB Übersicht'!$AC$3,Raumabsorption!S18,IF('LDB Übersicht'!$E$4='LDB Übersicht'!$AC$4,Raumabsorption!T18,IF('LDB Übersicht'!$E$4='LDB Übersicht'!$AC$5,Raumabsorption!U18,IF('LDB Übersicht'!$E$4='LDB Übersicht'!$AC$6,Raumabsorption!V18,\"\"))))","v":"Bedroom:"},null,null,"1,0 s","30 dB(A)",null,null,null,1.2,"Versammlungssäle:","Meeting rooms:","Salles de réunions:","Sale riunioni:"]
[null,null,null,{"$f":"IF('LDB Übersicht'!$E$4='LDB Übersicht'!$AC$3,Raumabsorption!S7,IF('LDB Übersicht'!$E$4='LDB Übersicht'!$AC$4,Raumabsorption!T7,IF('LDB Übersicht'!$E$4='LDB Übersicht'!$AC$5,Raumabsorption!U7,IF('LDB Übersicht'!$E$4='LDB Übersicht'!$AC$6,Raumabsorption!V7,\"\"))))","v":"Open-plan office:"},null,null,"0,5 s","40 dB(A)",null,{"$f":"IF('LDB Übersicht'!$E$4='LDB Übersicht'!$AC$3,Raumabsorption!S19,IF('LDB Übersicht'!$E$4='LDB Übersicht'!$AC$4,Raumabsorption!T19,IF('LDB Übersicht'!$E$4='LDB Übersicht'!$AC$5,Raumabsorption!U19,IF('LDB Übersicht'!$E$4='LDB Übersicht'!$AC$6,Raumabsorption!V19,\"\"))))","v":"Hall, Corridor:"},null,null,"2,0 s","40 dB(A)",null,null,null,1.3,"Theater:","Theatre:","Théâtre:","Teatro:"]
[null,null,null,{"$f":"IF('LDB Übersicht'!$E$4='LDB Übersicht'!$AC$3,Raumabsorption!S8,IF('LDB Übersicht'!$E$4='LDB Übersicht'!$AC$4,Raumabsorption!T8,IF('LDB Übersicht'!$E$4='LDB Übersicht'!$AC$5,Raumabsorption!U8,IF('LDB Übersicht'!$E$4='LDB Übersicht'!$AC$6,Raumabsorption!V8,\"\"))))","v":"Meeting room:"},null,null,"1,0 s","35 dB(A)",null,{"$f":"IF('LDB Übersicht'!$E$4='LDB Übersicht'!$AC$3,Raumabsorption!S20,IF('LDB Übersicht'!$E$4='LDB Übersicht'!$AC$4,Raumabsorption!T20,IF('LDB Übersicht'!$E$4='LDB Übersicht'!$AC$5,Raumabsorption!U20,IF('LDB Übersicht'!$E$4='LDB Übersicht'!$AC$6,Raumabsorption!V20,\"\"))))","v":"Medical inspection rooms:"},null,null,"2,0 s","40 dB(A)",null,null,null,1.4,"Opernhaus:","Opera House:","Opéra:","Teatro dell'opera:"]
[null,null,null,null,null,null,null,null,null,{"$f":"IF('LDB Übersicht'!$E$4='LDB Übersicht'!$AC$3,Raumabsorption!S21,IF('LDB Übersicht'!$E$4='LDB Übersicht'!$AC$4,Raumabsorption!T21,IF('LDB Übersicht'!$E$4='LDB Übersicht'!$AC$5,Raumabsorption!U21,IF('LDB Übersicht'!$E$4='LDB Übersicht'!$AC$6,Raumabsorption!V21,\"\"))))","v":"Operation rooms:"},null,null,"3,0 s","40 dB(A)",null,null,null,1.5,"Konzertsaal:","Concert hall:","Salle de concert:","Sala concerti:"]
[null,null,null,{"$f":"IF('LDB Übersicht'!$E$4='LDB Übersicht'!$AC$3,Raumabsorption!S9,IF('LDB Übersicht'!$E$4='LDB Übersicht'!$AC$4,Raumabsorption!T9,IF('LDB Übersicht'!$E$4='LDB Übersicht'!$AC$5,Raumabsorption!U9,IF('LDB Übersicht'!$E$4='LDB Übersicht'!$AC$6,Raumabsorption!V9,\"\"))))","v":"Residential building:"},null,null,null,null,null,null,null,null,null,null,null,null,null,1.6,"Kino, Hörsaal, Lesesaal:","Cinema, lecture hall, reading room:","Cinéma, amphithéâtre, salle de lecture:","Cinema, aula magna, sala lettura:"]
[null,null,null,{"$f":"IF('LDB Übersicht'!$E$4='LDB Übersicht'!$AC$3,Raumabsorption!S10,IF('LDB Übersicht'!$E$4='LDB Übersicht'!$AC$4,Raumabsorption!T10,IF('LDB Übersicht'!$E$4='LDB Übersicht'!$AC$5,Raumabsorption!U10,IF('LDB Übersicht'!$E$4='LDB Übersicht'!$AC$6,Raumabsorption!V10,\"\"))))","v":"Living- and sleeping room:"},null,null,"0,5 s","-",null,{"$f":"IF('LDB Übersicht'!$E$4='LDB Übersicht'!$AC$3,Raumabsorption!S11,IF('LDB Übersicht'!$E$4='LDB Übersicht'!$AC$4,Raumabsorption!T11,IF('LDB Übersicht'!$E$4='LDB Übersicht'!$AC$5,Raumabsorption!U11,IF('LDB Übersicht'!$E$4='LDB Übersicht'!$AC$6,Raumabsorption!V11,\"\"))))","v":"Hotel:"},null,null,null,null,null,null,null,1.7,"Kirche:","Church:","Église:","Chiesa:"]
[null,null,null,null,null,null,null,null,null,{"$f":"IF('LDB Übersicht'!$E$4='LDB Übersicht'!$AC$3,Raumabsorption!S12,IF('LDB Übersicht'!$E$4='LDB Übersicht'!$AC$4,Raumabsorption!T12,IF('LDB Übersicht'!$E$4='LDB Übersicht'!$AC$5,Raumabsorption!U12,IF('LDB Übersicht'!$E$4='LDB Übersicht'!$AC$6,Raumabsorption!V12,\"\"))))","v":"small Hotelroom (V > 40m^3):"},null,null,"1,0 s","30 - 35 dB(A)",null,null,null,1.8,"Sport:","Sports:","Des sports: ","Gli sport:"]
[null,null,null,{"$f":"IF('LDB Übersicht'!$E$4='LDB Übersicht'!$AC$3,Raumabsorption!S22,IF('LDB Übersicht'!$E$4='LDB Übersicht'!$AC$4,Raumabsorption!T22,IF('LDB Übersicht'!$E$4='LDB Übersicht'!$AC$5,Raumabsorption!U22,IF('LDB Übersicht'!$E$4='LDB Übersicht'!$AC$6,Raumabsorption!V22,\"\"))))","v":"Meeting rooms:"},null,null,null,null,null,{"$f":"IF('LDB Übersicht'!$E$4='LDB Übersicht'!$AC$3,Raumabsorption!S13,IF('LDB Übersicht'!$E$4='LDB Übersicht'!$AC$4,Raumabsorption!T13,IF('LDB Übersicht'!$E$4='LDB Übersicht'!$AC$5,Raumabsorption!U13,IF('LDB Übersicht'!$E$4='LDB Übersicht'!$AC$6,Raumabsorption!V13,\"\"))))","v":"big Hotelroom (V > 40m^3):"},null,null,"0,5 s","30 - 35 dB(A)",null,null,null,1.9,"Turnhalle:","Gym:","Gym:","Palestra:"]
[null,null,null,{"$f":"IF('LDB Übersicht'!$E$4='LDB Übersicht'!$AC$3,Raumabsorption!S23,IF('LDB Übersicht'!$E$4='LDB Übersicht'!$AC$4,Raumabsorption!T23,IF('LDB Übersicht'!$E$4='LDB Übersicht'!$AC$5,Raumabsorption!U23,IF('LDB Übersicht'!$E$4='LDB Übersicht'!$AC$6,Raumabsorption!V23,\"\"))))","v":"Theatre:"},null,null,"1,0 s","-",null,null,null,null,null,null,null,null,null,2,"Schwimmbäder:","Swimming pools:","Piscines:","Piscine:"]
[null,null,null,{"$f":"IF('LDB Übersicht'!$E$4='LDB Übersicht'!$AC$3,Raumabsorption!S24,IF('LDB Übersicht'!$E$4='LDB Übersicht'!$AC$4,Raumabsorption!T24,IF('LDB Übersicht'!$E$4='LDB Übersicht'!$AC$5,Raumabsorption!U24,IF('LDB Übersicht'!$E$4='LDB Übersicht'!$AC$6,Raumabsorption!V24,\"\"))))","v":"Opera House:"},null,null,"1,5 s","-",null,{"$f":"IF('LDB Übersicht'!$E$4='LDB Übersicht'!$AC$3,Raumabsorption!S28,IF('LDB Übersicht'!$E$4='LDB Übersicht'!$AC$4,Raumabsorption!T28,IF('LDB Übersicht'!$E$4='LDB Übersicht'!$AC$5,Raumabsorption!U28,IF('LDB Übersicht'!$E$4='LDB Übersicht'!$AC$6,Raumabsorption!V28,\"\"))))","v":"Sports:"},null,null,null,null,null,null,null,2.1,"Sonstige:","Others:","Autre:","Altro:"]
[null,null,null,{"$f":"IF('LDB Übersicht'!$E$4='LDB Übersicht'!$AC$3,Raumabsorption!S25,IF('LDB Übersicht'!$E$4='LDB Übersicht'!$AC$4,Raumabsorption!T25,IF('LDB Übersicht'!$E$4='LDB Übersicht'!$AC$5,Raumabsorption!U25,IF('LDB Übersicht'!$E$4='LDB Übersicht'!$AC$6,Raumabsorption!V25,\"\"))))","v":"Concert hall:"},null,null,"2,0 s","-",null,{"$f":"IF('LDB Übersicht'!$E$4='LDB Übersicht'!$AC$3,Raumabsorption!S29,IF('LDB Übersicht'!$E$4='LDB Übersicht'!$AC$4,Raumabsorption!T29,IF('LDB Übersicht'!$E$4='LDB Übersicht'!$AC$5,Raumabsorption!U29,IF('LDB Übersicht'!$E$4='LDB Übersicht'!$AC$6,Raumabsorption!V29,\"\"))))","v":"Gym:"},null,null,"1,5 s","45 dB(A)",null,null,null,2.2000000000000002,"Gaststätten:","Restaurants:","Restaurants:","Ristoranti:"]
[null,null,null,{"$f":"IF('LDB Übersicht'!$E$4='LDB Übersicht'!$AC$3,Raumabsorption!S26,IF('LDB Übersicht'!$E$4='LDB Übersicht'!$AC$4,Raumabsorption!T26,IF('LDB Übersicht'!$E$4='LDB Übersicht'!$AC$5,Raumabsorption!U26,IF('LDB Übersicht'!$E$4='LDB Übersicht'!$AC$6,Raumabsorption!V26,\"\"))))","v":"Cinema, lecture hall, reading room:"},null,null,"1,0 s","33 dB(A)",null,{"$f":"IF('LDB Übersicht'!$E$4='LDB Übersicht'!$AC$3,Raumabsorption!S30,IF('LDB Übersicht'!$E$4='LDB Übersicht'!$AC$4,Raumabsorption!T30,IF('LDB Übersicht'!$E$4='LDB Übersicht'!$AC$5,Raumabsorption!U30,IF('LDB Übersicht'!$E$4='LDB Übersicht'!$AC$6,Raumabsorption!V30,\"\"))))","v":"Swimming pools:"},null,null,"2,0 s","45 dB(A)",null,null,null,2.2999999999999998,"Museen:","Museeum:","Musées:","Musei:"]
[null,null,null,{"$f":"IF('LDB Übersicht'!$E$4='LDB Übersicht'!$AC$3,Raumabsorption!S27,IF('LDB Übersicht'!$E$4='LDB Übersicht'!$AC$4,Raumabsorption!T27,IF('LDB Übersicht'!$E$4='LDB Übersicht'!$AC$5,Raumabsorption!U27,IF('LDB Übersicht'!$E$4='LDB Übersicht'!$AC$6,Raumabsorption!V27,\"\"))))","v":"Church:"},null,null,"3,0 s","-",null,null,null,null,null,null,null,null,null,2.4,"Klassenräume:","Class rooms:","Salles de classe:","Aule:"]
[null,null,null,null,null,null,null,null,null,{"$f":"IF('LDB Übersicht'!$E$4='LDB Übersicht'!$AC$3,Raumabsorption!S31,IF('LDB Übersicht'!$E$4='LDB Übersicht'!$AC$4,Raumabsorption!T31,IF('LDB Übersicht'!$E$4='LDB Übersicht'!$AC$5,Raumabsorption!U31,IF('LDB Übersicht'!$E$4='LDB Übersicht'!$AC$6,Raumabsorption!V31,\"\"))))","v":"Others:"},null,null,null,null,null,null,null,2.5,"© LTG Aktiengesellschaft - Letzte Änderung: 05-03-2021; V1; LES","© LTG Aktiengesellschaft - Last update: 05-03-2021; V1; LES","© LTG Aktiengesellschaft - Dernière modification: 05-03-2021; V1; LES","© LTG Aktiengesellschaft - Ultimo aggiornamento: 05-03-2021; V1; LES"]
[null,null,null,{"$f":"IF('LDB Übersicht'!$E$4='LDB Übersicht'!$AC$3,Raumabsorption!S14,IF('LDB Übersicht'!$E$4='LDB Übersicht'!$AC$4,Raumabsorption!T14,IF('LDB Übersicht'!$E$4='LDB Übersicht'!$AC$5,Raumabsorption!U14,IF('LDB Übersicht'!$E$4='LDB Übersicht'!$AC$6,Raumabsorption!V14,\"\"))))","v":"Studios:"},null,null,null,null,null,{"$f":"IF('LDB Übersicht'!$E$4='LDB Übersicht'!$AC$3,Raumabsorption!S32,IF('LDB Übersicht'!$E$4='LDB Übersicht'!$AC$4,Raumabsorption!T32,IF('LDB Übersicht'!$E$4='LDB Übersicht'!$AC$5,Raumabsorption!U32,IF('LDB Übersicht'!$E$4='LDB Übersicht'!$AC$6,Raumabsorption!V32,\"\"))))","v":"Restaurants:"},null,null,"1,0 s","40 dB(A)",null,null,null,2.6,"Aus Programmierfehlern entstandener Schaden geht nicht zu Lasten der LTG. Technische Änderungen im Rahmen der Weiterentwicklung vorbehalten.","LTG is not responsible for any damage resulting from programming errors. Subject to technical changes in the course of further development.","LTG n'est pas responsable des dommages résultant d'erreurs de programmation. Sous réserve de modifications techniques en cours de développement.","LTG non è responsabile per eventuali danni derivanti da errori di programmazione. Soggetto a modifiche tecniche nel corso di ulteriori sviluppi."]
[null,null,null,{"$f":"IF('LDB Übersicht'!$E$4='LDB Übersicht'!$AC$3,Raumabsorption!S15,IF('LDB Übersicht'!$E$4='LDB Übersicht'!$AC$4,Raumabsorption!T15,IF('LDB Übersicht'!$E$4='LDB Übersicht'!$AC$5,Raumabsorption!U15,IF('LDB Übersicht'!$E$4='LDB Übersicht'!$AC$6,Raumabsorption!V15,\"\"))))","v":"Radio studio:"},null,null,"1,0 s","-",null,{"$f":"IF('LDB Übersicht'!$E$4='LDB Übersicht'!$AC$3,Raumabsorption!S33,IF('LDB Übersicht'!$E$4='LDB Übersicht'!$AC$4,Raumabsorption!T33,IF('LDB Übersicht'!$E$4='LDB Übersicht'!$AC$5,Raumabsorption!U33,IF('LDB Übersicht'!$E$4='LDB Übersicht'!$AC$6,Raumabsorption!V33,\"\"))))","v":"Museeum:"},null,null,"1,5 s","30 db(A)",null,null,null,2.7,"Zulässige A-bewertete Schalldruckpegel. Standardwerte gemäß EN 13779","Permissible A-weighting sound pressure level. Standard values ​​go to EN 13779","Niveau de pression acoustique pondéré A. admissible. Les valeurs standard vont à EN 13779","Livello di pressione sonora di ponderazione A consentito. I valori standard vanno a EN 13779"]
[null,null,null,{"$f":"IF('LDB Übersicht'!$E$4='LDB Übersicht'!$AC$3,Raumabsorption!S16,IF('LDB Übersicht'!$E$4='LDB Übersicht'!$AC$4,Raumabsorption!T16,IF('LDB Übersicht'!$E$4='LDB Übersicht'!$AC$5,Raumabsorption!U16,IF('LDB Übersicht'!$E$4='LDB Übersicht'!$AC$6,Raumabsorption!V16,\"\"))))","v":"TV studio:"},null,null,"1,5 s","-",null,{"$f":"IF('LDB Übersicht'!$E$4='LDB Übersicht'!$AC$3,Raumabsorption!S34,IF('LDB Übersicht'!$E$4='LDB Übersicht'!$AC$4,Raumabsorption!T34,IF('LDB Übersicht'!$E$4='LDB Übersicht'!$AC$5,Raumabsorption!U34,IF('LDB Übersicht'!$E$4='LDB Übersicht'!$AC$6,Raumabsorption!V34,\"\"))))","v":"Class rooms:"},null,null,"1,0 s","35 dB(A)",null,null,null,2.8]
[null,null,null,null,null,null,null,null,null,null,null,null,null,null,null,null,null,2.9]
[null,null,null,null,null,null,null,null,null,null,null,null,null,null,null,null,null,3]
[null,null,{"$f":"'LDB Übersicht'!D40","v":"© LTG Aktiengesellschaft: 28.07.2021 - LES - V1.5"}]
[null,null,{"$f":"'LDB Übersicht'!D41","v":"Information on tolerances and other specifications can be found in the current technical documentation."}]
[null,null,{"$f":"'LDB Übersicht'!D42","v":"You can find this at www.LTG.de. We cannot guarantee that the program is free from errors."}]

{"sheet":"LDB Auswahl","index":2,"n_rows":66,"n_cols":37,"rows_kept":66,"cut":false,"hidden":false,"merged":[[58,9,60,12],[57,3,57,5],[59,3,59,5],[59,7,59,8],[17,7,17,8],[19,7,19,8],[49,3,49,5],[49,7,49,8],[51,3,51,5],[51,7,51,8],[53,3,53,5],[55,3,55,5],[43,3,43,5],[43,7,43,8],[47,3,47,5],[47,7,47,8],[44,3,44,5],[45,3,45,5],[46,3,46,5],[31,3,31,5],[31,7,31,8],[33,3,33,5],[33,7,33,8],[35,3,35,5],[35,7,35,8],[45,7,45,8],[37,3,37,5],[37,7,37,8],[39,3,39,5],[39,7,39,8],[41,3,41,5],[41,7,41,8],[27,3,27,5],[29,3,29,5],[4,2,4,3],[4,4,4,7],[5,2,5,3],[5,4,5,7],[7,2,7,3],[7,4,7,7],[6,2,6,3],[6,4,6,7],[61,7,62,8],[61,9,62,10],[8,2,8,3],[8,4,8,7],[11,3,11,5],[11,7,11,9],[29,7,29,8],[13,3,13,5],[13,7,13,9],[15,3,15,5],[15,7,15,8],[17,3,17,5],[19,3,19,5],[21,3,21,5],[23,3,23,5],[25,3,25,5]]}
[]
[]
[null,null,{"$f":"'LDB Übersicht'!C3","v":"LTG Linear Diffusers Type LDB and LDB System Clean"},null,null,null,null,null,null,null,null,null,null,null,null,"Stückzahl","LDB Typ","Länge","Stutzendurchmesser original","Stutzendurchmesser gewählt",null,"DLU","Dp"]
[null,null,null,null,null,null,null,null,null,null,null,null,null,null,null,2,"LDB maxx/1",2100,200,{"$f":"IF(H20=\"80 mm\",80,IF(H20=\"100 mm\",100,IF(H20=\"125 mm\",125,IF(H20=\"140 mm\",140,IF(H20=\"160 mm\",160,IF(H20=\"200 mm\",200))))))","v":200}]
[null,null,{"$f":"'LDB Übersicht'!C7:D7","v":"Date:"},null,{"$f":"IF('LDB Übersicht'!E7=\"\",\"\",'LDB Übersicht'!E7)","v":"2021-07-29"},null,null,null,null,null,null,null,null,null,null,null,null,"Volumenstrom","Stutzenanzahl original","Stutzenanzahl gewählt"]
[null,null,{"$f":"'LDB Übersicht'!C8:D8","v":"Editor:"},null,{"$f":"IF('LDB Übersicht'!E8=\"\",\"\",'LDB Übersicht'!E8)","v":""},null,null,null,null,null,"E-Mail: Info@LTG.de ",null,null,null,null,null,null,{"$f":"IF(OR('LDB Übersicht'!$E$5='LDB Übersicht'!$AD$5,'LDB Übersicht'!$E$5='LDB Übersicht'!$AD$6,'LDB Übersicht'!$E$5='LDB Übersicht'!$AD$7,'LDB Übersicht'!$E$5='LDB Übersicht'!$AD$8),H22,IF(OR('LDB Übersicht'!$E$5='LDB Übersicht'!$AD$9,'LDB Übersicht'!$E$5='LDB Übersicht'!$AD$10,'LDB Übersicht'!$E$5='LDB Übersicht'!$AD$11,'LDB Übersicht'!$E$5='LDB Übersicht'!$AD$12),H22/0.5875,\"\"))","v":1000.8510638297872},3,{"$f":"H18","v":3},null,null,"0°","45°","60°","75°","90°",{"$f":"H46","v":"-"}]
[null,null,{"$f":"'LDB Übersicht'!C9:D9","v":"Project:"},null,{"$f":"IF('LDB Übersicht'!E9=\"\",\"\",'LDB Übersicht'!E9)","v":""},null,null,null,null,null,"Tel. +49 (0)711 8201-0",null,null,null,null,"Schallleistung","Schallleistung korrigiert","Schallleistung Rest","80 mm",1,null,80,0,{"$f":"0.0013*(R6/T6)^2 - 0.0111*(R6/T6)","v":140.98726301493886},{"$f":"0.0025*(R6/T6)^2 + 0.0016*(R6/T6) - 0.0000000000003","v":278.78457944771361},{"$f":"0.0048*(R6/T6)^2 + 0.0083*(R6/T6) - 0.00000000000006","v":537.01054232684442},{"$f":"0.0075*(R6/T6)^2 + 0.05*(R6/T6) + 0.0000000000005","v":851.43322770484406},{"$f":"HLOOKUP(H46,$W$6:$AA$11,2,FALSE)","v":{"$error":"#N/A"}},"DLU DP"]
[null,null,{"$f":"'LDB Übersicht'!C10:D10","v":"Variant:"},null,{"$f":"IF('LDB Übersicht'!E10=\"\",\"\",'LDB Übersicht'!E10)","v":""},null,null,null,null,null,null,null,null,null,null,{"$f":"IF(OR($H$14=Q42,$H$14=Q43,$H$14=Q44,$H$14=Q45,$H$14=Q47,$H$14=Q48,$H$14=Q49,$H$14=Q50,$H$14=Q52,$H$14=Q53,$H$14=Q54,$H$14=Q55),Q8,R8)","v":36.949573041219566},{"$f":"+VLOOKUP(H14,Q42:T55,4,FALSE)","v":{"$error":"#N/A"}},36.949573041219566,"100 mm",{"$f":"+IF($T$12>2,2,\"\")","v":2},null,100,0,{"$f":"0.0013*(R6/T6)^2 - 0.0111*(R6/T6)","v":140.98726301493886},{"$f":"0.0025*(R6/T6)^2 + 0.0016*(R6/T6) - 0.0000000000003","v":278.78457944771361},{"$f":"0.0048*(R6/T6)^2 + 0.0083*(R6/T6) - 0.00000000000006","v":537.01054232684442},{"$f":"0.0075*(R6/T6)^2 + 0.05*(R6/T6) + 0.0000000000005","v":851.43322770484406},{"$f":"HLOOKUP(H46,$W$6:$AA$11,3,FALSE)","v":{"$error":"#N/A"}},{"$f":"+IF(AD8<0,0,AD8)","v":{"$error":"#N/A"}},{"$f":"+VLOOKUP(T4,V7:AB11,7,FALSE)","v":{"$error":"#N/A"}}]
[null,null,{"$f":"'LDB Übersicht'!C11:D11","v":"Order number:"},null,{"$f":"IF('LDB Übersicht'!E11=\"\",\"\",'LDB Übersicht'!E11)","v":""},null,null,null,null,null,null,null,null,null,null,null,null,null,"125 mm",{"$f":"+IF($T$12>3,3,\"\")","v":3},null,125,0,{"$f":"0.0003*(R6/T6)^2 + 0.0267*(R6/T6) + 0.00000000000006","v":42.297669533725717},{"$f":"0.0012*(R6/T6)^2 - 0.0058*(R6/T6) - 0.00000000000004","v":131.62540153915793},{"$f":"0.0024*(R6/T6)^2 - 0.0117*(R6/T6) - 0.00000000000009","v":263.21744137618811},{"$f":"0.0045*(R6/T6)^2 + 0.0118*(R6/T6) + 0.2196","v":505.00770683567214},{"$f":"HLOOKUP(H46,$W$6:$AA$11,4,FALSE)","v":{"$error":"#N/A"}}]
[null,null,null,null,null,null,null,null,null,null,null,null,null,null,null,null,null,null,"140 mm",{"$f":"+IF($T$12>4,4,\"\")","v":4},null,140,0,{"$f":"0.0004*(R6/T6)^2 - 0.0042*(R6/T6) - 0.00000000000001","v":43.118935264825701},{"$f":"0.0009*(R6/T6)^2 - 0.0217*(R6/T6) + 0.00000000000006","v":92.930795835219598},{"$f":"0.0013*(R6/T6)^2 + 0.05*(R6/T6) + 0.0000000000008","v":161.37126301493964},{"$f":"0.0034*(R6/T6)^2 - 0.0062*(R6/T6) - 0.00000000000006","v":376.35265187867799},{"$f":"HLOOKUP(H46,$W$6:$AA$11,5,FALSE)","v":{"$error":"#N/A"}}]
[null,null,null,null,null,null,null,null,null,null,null,null,null,null,null,{"$f":"IF('LDB Übersicht'!$E$4='LDB Übersicht'!$AC$3,P12,IF('LDB Übersicht'!$E$4='LDB Übersicht'!$AC$4,P13,IF('LDB Übersicht'!$E$4='LDB Übersicht'!$AC$5,P14,IF('LDB Übersicht'!$E$4='LDB Übersicht'!$AC$6,P15))))","v":"Print selection"},null,null,"160 mm",null,null,160,0,{"$f":"0.0004*(R6/T6)^2 - 0.0042*(R6/T6) - 0.00000000000001","v":43.118935264825701},{"$f":"0.0009*(R6/T6)^2 - 0.0217*(R6/T6) + 0.00000000000006","v":92.930795835219598},{"$f":"0.0013*(R6/T6)^2 + 0.05*(R6/T6) + 0.0000000000008","v":161.37126301493964},{"$f":"0.0034*(R6/T6)^2 - 0.0062*(R6/T6) - 0.00000000000006","v":376.35265187867799},{"$f":"HLOOKUP(H46,$W$6:$AA$11,6,FALSE)","v":{"$error":"#N/A"}}]
[null,null,null,{"$f":"IF('LDB Übersicht'!$E$4='LDB Übersicht'!$AC$3,Legende!A56,IF('LDB Übersicht'!$E$4='LDB Übersicht'!$AC$4,Legende!B56,IF('LDB Übersicht'!$E$4='LDB Übersicht'!$AC$5,Legende!C56,IF('LDB Übersicht'!$E$4='LDB Übersicht'!$AC$6,Legende!D56,\"\"))))","v":"Room name"},null,null,":",null,null,null,null,null,null,null,null,"Auswahl drucken",null,null,"200 mm",{"$f":"+ROUNDDOWN((R4-200)/T4,0)","v":9},null,null,null,"LWA"]
[null,null,null,null,null,null,null,null,null,null,null,null,null,null,null,"Print selection",null,null,null,null,null,null,"0°","45°","60°","75°","90°",{"$f":"H46","v":"-"},"DLU LWA"]
[null,null,null,{"$f":"'LDB Übersicht'!D17","v":"LDB Type"},null,null,":","LDB 50 maxx 1-schlitzig",null,null,null,null,null,null,null,"Sélection de l'impression",null,null,null,null,null,80,0,{"$f":"18.581*LN((R6/T6)) - 58.599","v":49.356492794663048},{"$f":"21.392*LN((R6/T6)) - 66.656","v":57.63138506342132},{"$f":"36.995*LN((R6/T6)) - 137.11","v":77.830716642729584},{"$f":"36.995*LN((R6/T6)) - 137.11","v":77.830716642729584},{"$f":"HLOOKUP(H46,$W$13:$AA$18,2,FALSE)","v":{"$error":"#N/A"}},{"$f":"+IF(AD14<0,0,AD14)","v":{"$error":"#N/A"}},{"$f":"+VLOOKUP(T4,V14:AB18,7,FALSE)","v":{"$error":"#N/A"}}]
[null,null,null,null,null,null,null,null,null,null,null,null,null,null,null,"Selezione di stampa",null,null,null,null,null,100,0,{"$f":"18.581*LN((R6/T6)) - 58.599","v":49.356492794663048},{"$f":"21.392*LN((R6/T6)) - 66.656","v":57.63138506342132},{"$f":"36.995*LN((R6/T6)) - 137.11","v":77.830716642729584},{"$f":"36.995*LN((R6/T6)) - 137.11","v":77.830716642729584},{"$f":"HLOOKUP(H46,$W$13:$AA$18,3,FALSE)","v":{"$error":"#N/A"}}]
[null,null,null,{"$f":"'LDB Übersicht'!K16","v":"Diffuser element length"},null,null,":","2100 mm",null,null,null,null,null,null,null,null,null,null,null,null,null,125,0,{"$f":"21.64*LN((R6/T6)) - 78.603","v":47.125263499085534},{"$f":"22.407*LN((R6/T6)) - 78.72","v":51.464528660998582},{"$f":"22.407*LN((R6/T6)) - 73.189","v":56.995528660998588},{"$f":"22.197*LN((R6/T6)) - 71.267","v":57.697429985637768},{"$f":"HLOOKUP(H46,$W$13:$AA$18,4,FALSE)","v":{"$error":"#N/A"}}]
[null,null,null,null,null,null,null,null,null,null,null,null,null,null,null,null,null,null,null,null,null,140,0,{"$f":"25.974*LN((R6/T6)) - 103.36","v":47.548776161055812},{"$f":"24.302*LN((R6/T6)) - 91.672","v":49.522466707706855},{"$f":"25.532*LN((R6/T6)) - 93.578","v":54.762758949105887},{"$f":"25.532*LN((R6/T6)) - 89.578","v":58.762758949105887},{"$f":"HLOOKUP(H46,$W$13:$AA$18,5,FALSE)","v":{"$error":"#N/A"}}]
[null,null,null,{"$f":"IF('LDB Übersicht'!$E$4='LDB Übersicht'!$AC$3,Legende!A57,IF('LDB Übersicht'!$E$4='LDB Übersicht'!$AC$4,Legende!B57,IF('LDB Übersicht'!$E$4='LDB Übersicht'!$AC$5,Legende!C57,IF('LDB Übersicht'!$E$4='LDB Übersicht'!$AC$6,Legende!D57,\"\"))))","v":"No. of spigots [pc]"},null,null,":",3,null,null,null,null,null,null,null,null,null,null,null,null,null,160,0,{"$f":"25.974*LN((R6/T6)) - 103.36","v":47.548776161055812},{"$f":"24.302*LN((R6/T6)) - 91.672","v":49.522466707706855},{"$f":"25.532*LN((R6/T6)) - 93.578","v":54.762758949105887},{"$f":"25.532*LN((R6/T6)) - 89.578","v":58.762758949105887},{"$f":"HLOOKUP(H46,$W$13:$AA$18,6,FALSE)","v":{"$error":"#N/A"}}]
[]
[null,null,null,{"$f":"IF('LDB Übersicht'!$E$4='LDB Übersicht'!$AC$3,Legende!A58,IF('LDB Übersicht'!$E$4='LDB Übersicht'!$AC$4,Legende!B58,IF('LDB Übersicht'!$E$4='LDB Übersicht'!$AC$5,Legende!C58,IF('LDB Übersicht'!$E$4='LDB Übersicht'!$AC$6,Legende!D58,\"\"))))","v":"Spigot diameter [mm]"},null,null,":","200 mm",null,null,null,null,null,null,null,null,null,null,null,null,null,null,"D=100","D=125","D=140","D=160","D=200","offen","30°","45°","60°","90°","offen","20°","30°","40°","55°"]
[null,null,null,null,null,null,null,null,null,null,null,null,null,null,null,null,null,null,null,null,null,null,null,null,null,null,null,null,22.001000000000001,21.937000000000001,21.977,21.760999999999999,null,22.001000000000001,21.937000000000001,21.977,21.760999999999999]
[null,null,null,{"$f":"IF('LDB Übersicht'!$E$4='LDB Übersicht'!$AC$3,Legende!A59,IF('LDB Übersicht'!$E$4='LDB Übersicht'!$AC$4,Legende!B59,IF('LDB Übersicht'!$E$4='LDB Übersicht'!$AC$5,Legende!C59,IF('LDB Übersicht'!$E$4='LDB Übersicht'!$AC$6,Legende!D59,\"\"))))","v":"Air flow rate"},null,null,":",588,{"$f":"IF(OR('LDB Übersicht'!$E$5='LDB Übersicht'!$AD$5,'LDB Übersicht'!$E$5='LDB Übersicht'!$AD$6,'LDB Übersicht'!$E$5='LDB Übersicht'!$AD$7,'LDB Übersicht'!$E$5='LDB Übersicht'!$AD$8),\"m³/h\",IF(OR('LDB Übersicht'!$E$5='LDB Übersicht'!$AD$9,'LDB Übersicht'!$E$5='LDB Übersicht'!$AD$10,'LDB Übersicht'!$E$5='LDB Übersicht'!$AD$11,'LDB Übersicht'!$E$5='LDB Übersicht'!$AD$12),\"cfm\",\"\"))","v":"cfm"},null,null,null,null,null,null,null,null,null,null,null,null,"KLA",{"$f":"HLOOKUP(H46,$AB$20:$AF$25,2,FALSE)","v":{"$error":"#N/A"}},{"$f":"HLOOKUP(H46,$AB$20:$AF$25,3,FALSE)","v":{"$error":"#N/A"}},{"$f":"HLOOKUP(H46,$AB$20:$AF$25,4,FALSE)","v":{"$error":"#N/A"}},{"$f":"HLOOKUP(H46,$AB$20:$AF$25,5,FALSE)","v":{"$error":"#N/A"}},{"$f":"HLOOKUP(H46,$AB$20:$AF$25,6,FALSE)","v":{"$error":"#N/A"}},null,23.225999999999999,22.532,22.635999999999999,22.713000000000001,null,23.225999999999999,22.532,22.635999999999999,22.713000000000001]
[null,null,null,null,null,null,null,null,null,null,null,null,null,null,null,null,null,null,null,null,null,"KLU",{"$f":"HLOOKUP(H46,$AG$20:$AK$25,2,FALSE)","v":{"$error":"#N/A"}},{"$f":"HLOOKUP(H46,$AG$20:$AK$25,3,FALSE)","v":{"$error":"#N/A"}},{"$f":"HLOOKUP(H46,$AG$20:$AK$25,4,FALSE)","v":{"$error":"#N/A"}},{"$f":"HLOOKUP(H46,$AG$20:$AK$25,5,FALSE)","v":{"$error":"#N/A"}},{"$f":"HLOOKUP(H46,$AG$20:$AK$25,6,FALSE)","v":{"$error":"#N/A"}},null,22.785,22.370999999999999,22.370999999999999,21.661000000000001,null,22.785,22.370999999999999,22.370999999999999,21.661000000000001]
[null,null,null,{"$f":"IF('LDB Übersicht'!$E$4='LDB Übersicht'!$AC$3,Legende!A108,IF('LDB Übersicht'!$E$4='LDB Übersicht'!$AC$4,Legende!B108,IF('LDB Übersicht'!$E$4='LDB Übersicht'!$AC$5,Legende!C108,IF('LDB Übersicht'!$E$4='LDB Übersicht'!$AC$6,Legende!D108,\"\"))))","v":"Supply air under temperature"},null,null,":",{"$f":"'LDB Übersicht'!AC16","v":5},"K",null,null,null,null,null,null,null,null,null,null,null,null,"DLU",null,null,null,null,null,null,22.994,23.08,22.666,23.082999999999998,null,22.994,23.08,22.666,23.082999999999998]
[null,null,null,null,null,null,null,null,null,null,null,null,null,null,null,null,"Profilabschluss","Kasten","Schalldämpfer","Second fix","Aufhängung",null,null,null,null,null,null,null,22.407,21.762,21.440999999999999,21.440999999999999,null,22.407,21.762,21.440999999999999,21.440999999999999]
[null,null,null,{"$f":"'LDB Übersicht'!$P$14","v":"Jet spreading supply air "},null,null,":",5,{"$f":"IF(OR('LDB Übersicht'!$E$5='LDB Übersicht'!$AD$5,'LDB Übersicht'!$E$5='LDB Übersicht'!$AD$6,'LDB Übersicht'!$E$5='LDB Übersicht'!$AD$7,'LDB Übersicht'!$E$5='LDB Übersicht'!$AD$8),\"m\",IF(OR('LDB Übersicht'!$E$5='LDB Übersicht'!$AD$9,'LDB Übersicht'!$E$5='LDB Übersicht'!$AD$10,'LDB Übersicht'!$E$5='LDB Übersicht'!$AD$11,'LDB Übersicht'!$E$5='LDB Übersicht'!$AD$12),\"ft\",\"\"))","v":"ft"},null,null,null,null,null,null,null,"-","-","-","O","O"]
[null,null,null,null,null,null,null,null,null,null,null,null,null,null,null,null,"B","S","S","M","B"]
[null,null,null,{"$f":"'LDB Übersicht'!$R$14","v":"Max. air velocity"},null,null,":",0.22,{"$f":"IF(OR('LDB Übersicht'!$E$5='LDB Übersicht'!$AD$5,'LDB Übersicht'!$E$5='LDB Übersicht'!$AD$6,'LDB Übersicht'!$E$5='LDB Übersicht'!$AD$7,'LDB Übersicht'!$E$5='LDB Übersicht'!$AD$8),\"m/s\",IF(OR('LDB Übersicht'!$E$5='LDB Übersicht'!$AD$9,'LDB Übersicht'!$E$5='LDB Übersicht'!$AD$10,'LDB Übersicht'!$E$5='LDB Übersicht'!$AD$11,'LDB Übersicht'!$E$5='LDB Übersicht'!$AD$12),\"ft/s\",\"\"))","v":"ft/s"},null,null,null,null,null,null,null,"R","D",null,null,"DB","Konstantenauswahl aus rechtsstehender Liste",null,null,null,null,null,"KLA Konstante  für Akustikgleichung",null,null,null,null,"KLU Konstante für Akustikgleichung"]
[null,null,null,null,null,null,null,null,null,null,null,null,null,null,null,null,"L","X",null,null,null,null,"D=100","D=125","D=140","D=160","D=200","offen","30°","45°","60°","90°","offen","20°","30°","40°","55°"]
[null,null,null,{"$f":"'LDB Übersicht'!$T$14","v":"Draught risk"},null,null,":",17,null,null,null,null,null,null,null,null,null,"W",null,null,null,null,null,null,null,null,null,null,-63.154000000000003,-61.764000000000003,-61.006,-59.148000000000003,null,-63.154000000000003,-61.764000000000003,-61.006,-59.148000000000003]
[null,null,null,null,null,null,null,null,null,null,null,null,null,null,null,null,"Drossel",null,null,null,null,"KLA",{"$f":"HLOOKUP(H46,$AB$29:$AF$34,2,FALSE)","v":{"$error":"#N/A"}},{"$f":"HLOOKUP(H46,$AB$29:$AF$34,3,FALSE)","v":{"$error":"#N/A"}},{"$f":"HLOOKUP(H46,$AB$29:$AF$34,4,FALSE)","v":{"$error":"#N/A"}},{"$f":"HLOOKUP(H46,$AB$29:$AF$34,5,FALSE)","v":{"$error":"#N/A"}},{"$f":"HLOOKUP(H46,$AB$29:$AF$34,6,FALSE)","v":{"$error":"#N/A"}},null,-78.36,-74.185000000000002,-73.731999999999999,-72.991,null,-78.36,-74.185000000000002,-73.731999999999999,-72.991]
[null,null,null,{"$f":"'LDB Übersicht'!$U$15","v":"Category       DIN EN ISO 7730"},null,null,":","B",null,null,null,null,null,null,null,{"$f":"IF('LDB Übersicht'!$E$4='LDB Übersicht'!$AC$3,P33,IF('LDB Übersicht'!$E$4='LDB Übersicht'!$AC$4,P34,IF('LDB Übersicht'!$E$4='LDB Übersicht'!$AC$5,P35,IF('LDB Übersicht'!$E$4='LDB Übersicht'!$AC$6,P36))))","v":"Information"},"SDA",{"$f":"IF($H$44=$Q$32,\"-\",IF($H$44=\"DLU\",\"0°\",IF($H$44=\"-\",\"-\",IF($H$44=$Q$34,\"30°\",IF($H$44=$Q$35,\"20°\")))))","v":"-"},null,null,null,"KLU",{"$f":"HLOOKUP(H46,$AG$29:$AK$34,2,FALSE)","v":{"$error":"#N/A"}},{"$f":"HLOOKUP(H46,$AG$29:$AK$34,3,FALSE)","v":{"$error":"#N/A"}},{"$f":"HLOOKUP(H46,$AG$29:$AK$34,4,FALSE)","v":{"$error":"#N/A"}},{"$f":"HLOOKUP(H46,$AG$29:$AK$34,5,FALSE)","v":{"$error":"#N/A"}},{"$f":"HLOOKUP(H46,$AG$29:$AK$34,6,FALSE)","v":{"$error":"#N/A"}},null,-81.468999999999994,-78.543000000000006,-77.543000000000006,-72.853999999999999,null,-81.468999999999994,-78.543000000000006,-77.543000000000006,-72.853999999999999]
[null,null,null,null,null,null,null,null,null,null,null,null,null,null,null,"Information",{"$f":"IF(OR($H$14=Q42,$H$14=Q43,$H$14=Q44,$H$14=Q45,$H$14=Q47,$H$14=Q48,$H$14=Q49,$H$14=Q50,$H$14=Q52,$H$14=Q53,$H$14=Q54,$H$14=Q55),\"DLU\",\"-\")","v":"-"},{"$f":"IF($H$44=$Q$32,\"-\",IF($H$44=\"DLU\",\"45°\",IF($H$44=\"-\",\"-\",IF($H$44=$Q$34,\"45°\",IF($H$44=$Q$35,\"30°\")))))","v":"-"},null,null,null,"DLU",null,null,null,null,null,null,-89.03,-88.382999999999996,-85.364000000000004,-86.316999999999993,null,-89.03,-88.382999999999996,-85.364000000000004,-86.316999999999993]
[null,null,null,{"$f":"IF('LDB Übersicht'!$E$4='LDB Übersicht'!$AC$3,Legende!A61,IF('LDB Übersicht'!$E$4='LDB Übersicht'!$AC$4,Legende!B61,IF('LDB Übersicht'!$E$4='LDB Übersicht'!$AC$5,Legende!C61,IF('LDB Übersicht'!$E$4='LDB Übersicht'!$AC$6,Legende!D61,\"\"))))","v":"End Caps"},null,null,":","-",null,null,null,null,null,null,null,"Information",{"$f":"IF($T$4=79,\"-\",\"KLA\")","v":"KLA"},{"$f":"IF($H$44=$Q$32,\"-\",IF($H$44=\"DLU\",\"60°\",IF($H$44=\"-\",\"-\",IF($H$44=$Q$34,\"60°\",IF($H$44=$Q$35,\"40°\")))))","v":"-"},null,null,null,null,null,null,null,null,null,null,-95.504000000000005,-91.162999999999997,-88.463999999999999,-87.463999999999999,null,-95.504000000000005,-91.162999999999997,-88.463999999999999,-87.463999999999999]
[null,null,null,null,null,null,null,null,null,null,null,null,null,null,null,"Informations",{"$f":"IF($T$4=79,\"-\",\"KLU\")","v":"KLU"},{"$f":"IF($H$44=$Q$32,\"-\",IF($H$44=\"DLU\",\"75°\",IF($H$44=\"-\",\"-\",IF($H$44=$Q$34,\"90°\",IF($H$44=$Q$35,\"55°\")))))","v":"-"},null,null,null,"GLEICHUNG","D=99","D=124","D=139","D=159","D=199"]
[null,null,null,{"$f":"IF('LDB Übersicht'!$E$4='LDB Übersicht'!$AC$3,Legende!A62,IF('LDB Übersicht'!$E$4='LDB Übersicht'!$AC$4,Legende!B62,IF('LDB Übersicht'!$E$4='LDB Übersicht'!$AC$5,Legende!C62,IF('LDB Übersicht'!$E$4='LDB Übersicht'!$AC$6,Legende!D62,\"\"))))","v":"Box Type"},null,null,":","S",null,null,null,null,null,null,null,"Informazione",null,{"$f":"IF($H$44=$Q$32,\"-\",IF($H$44=\"DLU\",\"90°\",IF($H$44=\"-\",\"-\",IF($H$44=$Q$34,\"-\",IF($H$44=$Q$35,\"-\")))))","v":"-"},null,null,null,null,100,125,140,160,200]
[]
[null,null,null,{"$f":"IF('LDB Übersicht'!$E$4='LDB Übersicht'!$AC$3,Legende!A106,IF('LDB Übersicht'!$E$4='LDB Übersicht'!$AC$4,Legende!B106,IF('LDB Übersicht'!$E$4='LDB Übersicht'!$AC$5,Legende!C106,IF('LDB Übersicht'!$E$4='LDB Übersicht'!$AC$6,Legende!D106,\"\"))))","v":"Blind attachment"},null,null,":","O"]
[null,null,null,null,null,null,null,null,null,null,null,null,null,null,null,null,null,null,null,null,null,"FAKTOR",{"$f":"VLOOKUP(H44,$V$21:$AA$23,2,FALSE)","v":{"$error":"#N/A"}},{"$f":"VLOOKUP(H44,$V$21:$AA$23,3,FALSE)","v":{"$error":"#N/A"}},{"$f":"VLOOKUP(H44,$V$21:$AA$23,4,FALSE)","v":{"$error":"#N/A"}},{"$f":"VLOOKUP(H44,$V$21:$AA$23,5,FALSE)","v":{"$error":"#N/A"}},{"$f":"VLOOKUP(H44,$V$21:$AA$23,6,FALSE)","v":{"$error":"#N/A"}}]
[null,null,null,{"$f":"IF('LDB Übersicht'!$E$4='LDB Übersicht'!$AC$3,Legende!A63,IF('LDB Übersicht'!$E$4='LDB Übersicht'!$AC$4,Legende!B63,IF('LDB Übersicht'!$E$4='LDB Übersicht'!$AC$5,Legende!C63,IF('LDB Übersicht'!$E$4='LDB Übersicht'!$AC$6,Legende!D63,\"\"))))","v":"sound absorber"},null,null,":","-",null,null,null,null,null,null,null,{"$f":"IF('LDB Übersicht'!$E$4='LDB Übersicht'!$AC$3,P41,IF('LDB Übersicht'!$E$4='LDB Übersicht'!$AC$4,P42,IF('LDB Übersicht'!$E$4='LDB Übersicht'!$AC$5,P43,IF('LDB Übersicht'!$E$4='LDB Übersicht'!$AC$6,P44))))","v":"Info sound absorber"},null,"LWA Kasten El.","LWASchlitz El.","LWA",null,"KONSTANTE",{"$f":"VLOOKUP(H44,$V$30:$AA$32,2,FALSE)","v":{"$error":"#N/A"}},{"$f":"VLOOKUP(H44,$V$30:$AA$32,3,FALSE)","v":{"$error":"#N/A"}},{"$f":"VLOOKUP(H44,$V$30:$AA$32,4,FALSE)","v":{"$error":"#N/A"}},{"$f":"VLOOKUP(H44,$V$30:$AA$32,5,FALSE)","v":{"$error":"#N/A"}},{"$f":"VLOOKUP(H44,$V$30:$AA$32,6,FALSE)","v":{"$error":"#N/A"}}]
[null,null,null,null,null,null,null,null,null,null,null,null,null,null,null,"Information zum Schalldämpfer",null,"Mess. Hoffmann","Mess. Hoffmann","Element",null,"KORREKTUR",0,2,3,4,6,{"$f":"+IF(AC41<0,0,AC41)","v":{"$error":"#N/A"}},{"$f":"+((HLOOKUP(T4,W36:AA41,2,FALSE))*LN(R6/T6)+(HLOOKUP(T4,W36:AA41,3,FALSE)))+HLOOKUP(T4,W36:AA41,4,FALSE)","v":{"$error":"#N/A"}}]
[null,null,null,{"$f":"IF('LDB Übersicht'!$E$4='LDB Übersicht'!$AC$3,Legende!A64,IF('LDB Übersicht'!$E$4='LDB Übersicht'!$AC$4,Legende!B64,IF('LDB Übersicht'!$E$4='LDB Übersicht'!$AC$5,Legende!C64,IF('LDB Übersicht'!$E$4='LDB Übersicht'!$AC$6,Legende!D64,\"\"))))","v":"Subsequently installation  (Sec. Fix)"},null,null,":","O",null,null,null,null,null,null,null,"Info sound absorber",{"$f":"'LDB Übersicht'!E21&\" \"&'LDB Übersicht'!F21","v":"LDB 12 clean 1-slot"},{"$f":" (-0.0022355889*(T4)^2 + 0.4201809847*T4 + 5.399628589)*LN(R6/T6)+(-0.0000029509*(T4)^3 + 0.0099403371*(T4)^2 - 1.9777335627*T4+ 21.5271635053)+10*LOG(T6)","v":4.8292333985928311},{"$f":" 73.7573595264*LOG(R6/(R4/1000))-119.2146207935+10*LOG(R4/1000)","v":81.540856400033135},{"$f":"10*LOG(10^(0.1*S42)+10^(0.1*R42))","v":81.540856492635513}]
[null,null,null,null,null,null,null,null,null,null,null,null,null,null,null,"Informations sur le silencieux",{"$f":"'LDB Übersicht'!E22&\" \"&'LDB Übersicht'!F22","v":"LDB 12 clean 2-slot"},{"$f":" (0.000000036775*T4^4 - 0.000097789296*T4^3 + 0.031851098925*T4^2 - 3.518164042311*T4 + 153.06267686179)*LN(R6/T6)+(-0.000001589267*T4^4 + 0.001198286334*T4^3 - 0.287868077763*T4^2 + 27.229051331336*T4- 974.551194289673)","v":-3.7190474319156973E-3},{"$f":" 53.6850931947*LOG(R6/(R4/1000))  -89.3138537125+10*LOG(R4/1000)","v":57.685080185230476},{"$f":"10*LOG(10^(0.1*S43)+10^(0.1*R43))","v":57.685087579648844}]
[null,null,null,{"$f":"IF('LDB Übersicht'!$E$4='LDB Übersicht'!$AC$3,Legende!A65,IF('LDB Übersicht'!$E$4='LDB Übersicht'!$AC$4,Legende!B65,IF('LDB Übersicht'!$E$4='LDB Übersicht'!$AC$5,Legende!C65,IF('LDB Übersicht'!$E$4='LDB Übersicht'!$AC$6,Legende!D65,\"\"))))","v":"Connection-Type"},null,null,":","SDA",null,null,null,null,null,null,null,"Informazioni sull'assorbitore acustico",{"$f":"'LDB Übersicht'!E23&\" \"&'LDB Übersicht'!F23","v":"LDB 12 clean 3-slot"},{"$f":"(-0.000023788293*T4^3+0.006551313626*T4^2-0.573673222638*T4+42.996345567831)*LN(R6/T6)+(0.000099312149*T4^3-0.024864140926*T4^2+1.505393168403*T4-101.04319263046)+10*LOG(T6)","v":4.7841195936337142},{"$f":"57.5627700098*LOG(R6/(R4/1000)) -107.295103557+10*LOG(R4/1000)","v":50.088831125063862},{"$f":"10*LOG(10^(0.1*S44)+10^(0.1*R44))","v":50.088959153593187}]
[null,null,null,null,null,null,null,null,null,null,null,null,null,null,null,null,{"$f":"'LDB Übersicht'!E24&\" \"&'LDB Übersicht'!F24","v":"LDB 12 clean 4-slot"},{"$f":"(-0.000023788293*T4^3 + 0.006551313626*T4^2 - 0.573673222638*T4 + 42.996345567831)*LN(R6/T6)+(0.000099312149*T4^3 - 0.024864140926*T4^2 + 1.505393168403*T4 - 101.04319263046)+10*LOG(T6)","v":4.7841195936337142},{"$f":" 62.1456597122*LOG(R6/(R4/1000)) -121.8124227521+10*LOG(R4/1000)","v":47.845178721534808},{"$f":"10*LOG(10^(0.1*S45)+10^(0.1*R45))","v":47.845393340287998},null,"Faktorauswahl aus rechtsstehender Liste",null,null,null,null,null,"KLA Faktor für Druckverlustgleichung",null,null,null,null,"KLU Faktor für Druckverlustgleichung"]
[null,null,null,{"$f":"IF('LDB Übersicht'!$E$4='LDB Übersicht'!$AC$3,Legende!A66,IF('LDB Übersicht'!$E$4='LDB Übersicht'!$AC$4,Legende!B66,IF('LDB Übersicht'!$E$4='LDB Übersicht'!$AC$5,Legende!C66,IF('LDB Übersicht'!$E$4='LDB Übersicht'!$AC$6,Legende!D66,\"\"))))","v":"throttle damper"},null,null,":","-",null,null,null,null,null,null,null,null,{"$f":"'LDB Übersicht'!E30&\" \"&'LDB Übersicht'!F30","v":" "},null,null,null,null,null,"D=100","D=125","D=140","D=160","D=200","offen","30°","45°","60°","90°","offen","20°","30°","40°","55°"]
[null,null,null,null,null,null,null,null,null,null,null,null,null,null,null,null,{"$f":"'LDB Übersicht'!E26&\" \"&'LDB Übersicht'!F26","v":"LDB 12 style 1-slot"},{"$f":" (-0.0022355889*(T4)^2 + 0.4201809847*T4 + 5.399628589)*LN(R6/T6)+(-0.0000029509*(T4)^3 + 0.0099403371*(T4)^2 - 1.9777335627*T4+ 21.5271635053)+10*LOG(T6)","v":4.8292333985928311},{"$f":" 73.7573595264*LOG(R6/(R4/1000))-119.2146207935+10*LOG(R4/1000)","v":81.540856400033135},{"$f":"10*LOG(10^(0.1*S47)+10^(0.1*R47))","v":81.540856492635513},null,null,null,null,null,null,null,null,1.1000000000000001E-3,5.4999999999999997E-3,1.52E-2,2.4299999999999999E-2,null,1.1000000000000001E-3,5.4999999999999997E-3,1.52E-2,2.4299999999999999E-2]
[null,null,null,{"$f":"IF('LDB Übersicht'!$E$4='LDB Übersicht'!$AC$3,Legende!A67,IF('LDB Übersicht'!$E$4='LDB Übersicht'!$AC$4,Legende!B67,IF('LDB Übersicht'!$E$4='LDB Übersicht'!$AC$5,Legende!C67,IF('LDB Übersicht'!$E$4='LDB Übersicht'!$AC$6,Legende!D67,\"\"))))","v":"Pressure loss"},null,null,":",{"$f":"P49+IF(H44=\"DLU\",AC8,IF(OR(H44=\"SDA\",H44=\"-\"),0,AB64))","v":15},null,null,null,null,null,null,null,"Druckverlust",{"$f":"'LDB Übersicht'!E27&\" \"&'LDB Übersicht'!F27","v":"LDB 12 style 2-slot"},{"$f":" (0.000000036775*T4^4 - 0.000097789296*T4^3 + 0.031851098925*T4^2 - 3.518164042311*T4 + 153.06267686179)*LN(R6/T6)+(-0.000001589267*T4^4 + 0.001198286334*T4^3 - 0.287868077763*T4^2 + 27.229051331336*T4- 974.551194289673)","v":-3.7190474319156973E-3},{"$f":" 53.6850931947*LOG(R6/(R4/1000))  -89.3138537125+10*LOG(R4/1000)","v":57.685080185230476},{"$f":"10*LOG(10^(0.1*S48)+10^(0.1*R48))","v":57.685087579648844},null,"KLA",{"$f":"HLOOKUP(H46,$AB$46:$AF$51,2,FALSE)","v":{"$error":"#N/A"}},{"$f":"HLOOKUP(H46,$AB$46:$AF$51,3,FALSE)","v":{"$error":"#N/A"}},{"$f":"HLOOKUP(H46,$AB$46:$AF$51,4,FALSE)","v":{"$error":"#N/A"}},{"$f":"HLOOKUP(H46,$AB$46:$AF$51,5,FALSE)","v":{"$error":"#N/A"}},{"$f":"HLOOKUP(H46,$AB$46:$AF$51,6,FALSE)","v":{"$error":"#N/A"}},null,2.9999999999999997E-4,1.9E-3,3.3E-3,5.8999999999999999E-3,null,2.9999999999999997E-4,1.9E-3,3.3E-3,5.8999999999999999E-3]
[null,null,null,null,null,null,null,null,null,null,null,null,null,null,null,15,{"$f":"'LDB Übersicht'!E28&\" \"&'LDB Übersicht'!F28","v":"LDB 12 style 3-slot"},{"$f":"(-0.000023788293*T4^3+0.006551313626*T4^2-0.573673222638*T4+42.996345567831)*LN(R6/T6)+(0.000099312149*T4^3-0.024864140926*T4^2+1.505393168403*T4-101.04319263046)+10*LOG(T6)","v":4.7841195936337142},{"$f":"57.5627700098*LOG(R6/(R4/1000)) -107.295103557+10*LOG(R4/1000)","v":50.088831125063862},{"$f":"10*LOG(10^(0.1*S49)+10^(0.1*R49))","v":50.088959153593187},null,"KLU",{"$f":"HLOOKUP(H46,$AG$46:$AK$51,2,FALSE)","v":{"$error":"#N/A"}},{"$f":"HLOOKUP(H46,$AG$46:$AK$51,3,FALSE)","v":{"$error":"#N/A"}},{"$f":"HLOOKUP(H46,$AG$46:$AK$51,4,FALSE)","v":{"$error":"#N/A"}},{"$f":"HLOOKUP(H46,$AG$46:$AK$51,5,FALSE)","v":{"$error":"#N/A"}},{"$f":"HLOOKUP(H46,$AG$46:$AK$51,6,FALSE)","v":{"$error":"#N/A"}},null,2.0000000000000001E-4,1.1999999999999999E-3,2.8999999999999998E-3,4.1000000000000003E-3,null,2.0000000000000001E-4,1.1999999999999999E-3,2.8999999999999998E-3,4.1000000000000003E-3]
[null,null,null,{"$f":"IF('LDB Übersicht'!$E$4='LDB Übersicht'!$AC$3,Legende!A68,IF('LDB Übersicht'!$E$4='LDB Übersicht'!$AC$4,Legende!B68,IF('LDB Übersicht'!$E$4='LDB Übersicht'!$AC$5,Legende!C68,IF('LDB Übersicht'!$E$4='LDB Übersicht'!$AC$6,Legende!D68,\"\"))))","v":"A-rated sound power level"},null,null,":",{"$f":"ROUNDDOWN(10*LOG((10^(P8/10)+10^(IF(H44=\"DLU\",AC14,IF(OR(H44=\"SDA\",H44=\"-\"),0,AB41))/10))),1)","v":36.9},null,null,null,null,null,null,null,null,{"$f":"'LDB Übersicht'!E29&\" \"&'LDB Übersicht'!F29","v":"LDB 12 style 4-slot"},{"$f":"(-0.000023788293*T4^3 + 0.006551313626*T4^2 - 0.573673222638*T4 + 42.996345567831)*LN(R6/T6)+(0.000099312149*T4^3 - 0.024864140926*T4^2 + 1.505393168403*T4 - 101.04319263046)+10*LOG(T6)","v":4.7841195936337142},{"$f":" 62.1456597122*LOG(R6/(R4/1000)) -121.8124227521+10*LOG(R4/1000)","v":47.845178721534808},{"$f":"10*LOG(10^(0.1*S50)+10^(0.1*R50))","v":47.845393340287998},null,"DLU",null,null,null,null,null,null,{"$f":"1*10^-4","v":1E-4},5.0000000000000001E-4,1.1999999999999999E-3,2.5000000000000001E-3,null,{"$f":"1*10^-4","v":1E-4},5.0000000000000001E-4,1.1999999999999999E-3,2.5000000000000001E-3]
[null,null,null,null,null,null,null,null,null,null,null,null,null,null,null,"max.zulässiger Schalldruck im Raum",null,null,null,null,null,null,null,null,null,null,null,null,{"$f":"5*10^-5","v":5.0000000000000002E-5},2.9999999999999997E-4,5.9999999999999995E-4,8.0000000000000004E-4,null,{"$f":"5*10^-5","v":5.0000000000000002E-5},2.9999999999999997E-4,5.9999999999999995E-4,8.0000000000000004E-4]
[null,null,null,{"$f":"'LDB Übersicht'!$L$15","v":"Quantity"},null,null,":",2,null,null,null,null,null,null,null,{"$f":"'LDB Übersicht'!L10","v":35},{"$f":"'LDB Übersicht'!E31&\" \"&'LDB Übersicht'!F31","v":"LDB 20 classic 1-slot"},{"$f":"(-0.0022355889*(T4)^2 + 0.4201809847*T4 + 5.399628589)*LN(R6/T6)+(-0.0000029509*(T4)^3 + 0.0099403371*(T4)^2 - 1.9777335627*T4+ 21.5271635053)+10*LOG(T6)","v":4.8292333985928311},{"$f":"54.6883629879*LOG(R6/(R4/1000)) -78.1021786699+10*LOG(R4/1000)","v":71.583662385411969},{"$f":"10*LOG(10^(0.1*S52)+10^(0.1*R52))","v":71.583663302352932}]
[null,null,null,null,null,null,null,null,null,null,null,null,null,null,null,null,{"$f":"'LDB Übersicht'!E32&\" \"&'LDB Übersicht'!F32","v":"LDB 20 classic 2-slot"},{"$f":" (0.000000036775*T4^4 - 0.000097789296*T4^3 + 0.031851098925*T4^2 - 3.518164042311*T4 + 153.06267686179)*LN(R6/T6)+(-0.000001589267*T4^4 + 0.001198286334*T4^3 - 0.287868077763*T4^2 + 27.229051331336*T4- 974.551194289673)","v":-3.7190474319156973E-3},{"$f":"  53.6850931947*LOG(R6/(R4/1000)) -89.3138537125+10*LOG(R4/1000)","v":57.685080185230476},{"$f":"10*LOG(10^(0.1*S53)+10^(0.1*R53))","v":57.685087579648844}]
[null,null,null,{"$f":"'LDB Übersicht'!$M$16","v":"Diffuser length total room"},null,null,":",{"$f":"IF(OR('LDB Übersicht'!$E$5='LDB Übersicht'!$AD$5,'LDB Übersicht'!$E$5='LDB Übersicht'!$AD$6,'LDB Übersicht'!$E$5='LDB Übersicht'!$AD$7,'LDB Übersicht'!$E$5='LDB Übersicht'!$AD$8),H52*R4/1000,IF(OR('LDB Übersicht'!$E$5='LDB Übersicht'!$AD$9,'LDB Übersicht'!$E$5='LDB Übersicht'!$AD$10,'LDB Übersicht'!$E$5='LDB Übersicht'!$AD$11,'LDB Übersicht'!$E$5='LDB Übersicht'!$AD$12),(+H52*R4/1000)*3.28084))","v":13.779528000000001},{"$f":"IF(OR('LDB Übersicht'!$E$5='LDB Übersicht'!$AD$5,'LDB Übersicht'!$E$5='LDB Übersicht'!$AD$6,'LDB Übersicht'!$E$5='LDB Übersicht'!$AD$7,'LDB Übersicht'!$E$5='LDB Übersicht'!$AD$8),\"m\",IF(OR('LDB Übersicht'!$E$5='LDB Übersicht'!$AD$9,'LDB Übersicht'!$E$5='LDB Übersicht'!$AD$10,'LDB Übersicht'!$E$5='LDB Übersicht'!$AD$11,'LDB Übersicht'!$E$5='LDB Übersicht'!$AD$12),\"ft\",\"\"))","v":"ft"},null,null,null,null,null,null,null,{"$f":"'LDB Übersicht'!E33&\" \"&'LDB Übersicht'!F33","v":"LDB 20 classic 3-slot"},{"$f":"(-0.000023788293*T4^3 + 0.006551313626*T4^2 - 0.573673222638*T4 + 42.996345567831)*LN(R6/T6)+(0.000099312149*T4^3 - 0.024864140926*T4^2 + 1.505393168403*T4 - 101.04319263046)+10*LOG(T6)","v":4.7841195936337142},{"$f":" 65.3168380226*LOG(R6/(R4/1000)) -129.3287746354+10*LOG(R4/1000)","v":48.821718538884639},{"$f":"10*LOG(10^(0.1*S54)+10^(0.1*R54))","v":48.821889940869447},null,"Exponentenauswahl aus rechtsstehender Liste",null,null,null,null,null,"KLA Exponent für Druckverlustgleichung",null,null,null,null,"KLU Exponent für Druckverlustgleichung"]
[null,null,null,null,null,null,null,null,null,null,null,null,null,null,null,null,{"$f":"'LDB Übersicht'!E34&\" \"&'LDB Übersicht'!F34","v":"LDB 20 classic 4-slot"},{"$f":"(-0.000023788293*T4^3 + 0.006551313626*T4^2 - 0.573673222638*T4 + 42.996345567831)*LN(R6/T6)+(0.000099312149*T4^3 - 0.024864140926*T4^2 + 1.505393168403*T4 - 101.04319263046)+10*LOG(T6)","v":4.7841195936337142},{"$f":" 62.1456597122*LOG(R6/(R4/1000)) -121.8124227521+10*LOG(R4/1000)","v":47.845178721534808},{"$f":"10*LOG(10^(0.1*S55)+10^(0.1*R55))","v":47.845393340287998},null,null,"D=100","D=125","D=140","D=160","D=200","offen","30°","45°","60°","90°","offen","20°","30°","40°","55°"]
[null,null,null,{"$f":"IF('LDB Übersicht'!$E$4='LDB Übersicht'!$AC$3,Legende!A69,IF('LDB Übersicht'!$E$4='LDB Übersicht'!$AC$4,Legende!B69,IF('LDB Übersicht'!$E$4='LDB Übersicht'!$AC$5,Legende!C69,IF('LDB Übersicht'!$E$4='LDB Übersicht'!$AC$6,Legende!D69,\"\"))))","v":"Actual total air flow rate"},null,null,":",{"$f":"+ROUND(H52*H22,0)","v":1176},{"$f":"IF(OR('LDB Übersicht'!$E$5='LDB Übersicht'!$AD$5,'LDB Übersicht'!$E$5='LDB Übersicht'!$AD$6,'LDB Übersicht'!$E$5='LDB Übersicht'!$AD$7,'LDB Übersicht'!$E$5='LDB Übersicht'!$AD$8),\"m³/h\",IF(OR('LDB Übersicht'!$E$5='LDB Übersicht'!$AD$9,'LDB Übersicht'!$E$5='LDB Übersicht'!$AD$10,'LDB Übersicht'!$E$5='LDB Übersicht'!$AD$11,'LDB Übersicht'!$E$5='LDB Übersicht'!$AD$12),\"cfm\",\"\"))","v":"cfm"},null,null,null,null,null,null,null,null,null,null,null,null,null,null,null,null,null,null,null,2.0173999999999999,1.8543000000000001,1.8121,1.9328000000000001,null,2.0173999999999999,1.8543000000000001,1.8121,1.9328000000000001]
[null,null,null,null,null,null,null,null,null,null,null,null,null,null,null,null,null,null,null,null,null,"KLA",{"$f":"HLOOKUP(H46,$AB$55:$AF$60,2,FALSE)","v":{"$error":"#N/A"}},{"$f":"HLOOKUP(H46,$AB$55:$AF$60,3,FALSE)","v":{"$error":"#N/A"}},{"$f":"HLOOKUP(H46,$AB$55:$AF$60,4,FALSE)","v":{"$error":"#N/A"}},{"$f":"HLOOKUP(H46,$AB$55:$AF$60,5,FALSE)","v":{"$error":"#N/A"}},{"$f":"HLOOKUP(H46,$AB$55:$AF$60,6,FALSE)","v":{"$error":"#N/A"}},null,2.1069,1.8995,1.9675,2.0461999999999998,null,2.1069,1.8995,1.9675,2.0461999999999998]
[null,null,null,{"$f":"IF('LDB Übersicht'!$E$4='LDB Übersicht'!$AC$3,Legende!A70,IF('LDB Übersicht'!$E$4='LDB Übersicht'!$AC$4,Legende!B70,IF('LDB Übersicht'!$E$4='LDB Übersicht'!$AC$5,Legende!C70,IF('LDB Übersicht'!$E$4='LDB Übersicht'!$AC$6,Legende!D70,\"\"))))","v":"Room sound absorpion"},null,null,":",6.4,"dB",null,null,null,null,null,null,{"$f":"IF('LDB Übersicht'!$E$4='LDB Übersicht'!$AC$3,P59,IF('LDB Übersicht'!$E$4='LDB Übersicht'!$AC$4,P60,IF('LDB Übersicht'!$E$4='LDB Übersicht'!$AC$5,P61,IF('LDB Übersicht'!$E$4='LDB Übersicht'!$AC$6,P62))))","v":"Back"},{"$f":"IF('LDB Übersicht'!$E$4='LDB Übersicht'!$AC$3,Q59,IF('LDB Übersicht'!$E$4='LDB Übersicht'!$AC$4,Q60,IF('LDB Übersicht'!$E$4='LDB Übersicht'!$AC$5,Q61,IF('LDB Übersicht'!$E$4='LDB Übersicht'!$AC$6,Q62))))","v":"add to list"},{"$f":"IF('LDB Übersicht'!$E$4='LDB Übersicht'!$AC$3,R59,IF('LDB Übersicht'!$E$4='LDB Übersicht'!$AC$4,R60,IF('LDB Übersicht'!$E$4='LDB Übersicht'!$AC$5,R61,IF('LDB Übersicht'!$E$4='LDB Übersicht'!$AC$6,R62))))","v":"Information on throttle setting"},null,null,null,"KLU",{"$f":"HLOOKUP(H46,$AG$55:$AK$60,2,FALSE)","v":{"$error":"#N/A"}},{"$f":"HLOOKUP(H46,$AG$55:$AK$60,3,FALSE)","v":{"$error":"#N/A"}},{"$f":"HLOOKUP(H46,$AG$55:$AK$60,4,FALSE)","v":{"$error":"#N/A"}},{"$f":"HLOOKUP(H46,$AG$55:$AK$60,5,FALSE)","v":{"$error":"#N/A"}},{"$f":"HLOOKUP(H46,$AG$55:$AK$60,6,FALSE)","v":{"$error":"#N/A"}},null,2.0537000000000001,1.909,1.9083000000000001,2.0312999999999999,null,2.0537000000000001,1.909,1.9083000000000001,2.0312999999999999]
[null,null,null,null,null,null,null,null,null,{"$f":"IF(AND(H60>P52,'LDB Übersicht'!$E$4='LDB Übersicht'!$AC$3),Legende!A107,IF(AND(H60>P52,'LDB Übersicht'!$E$4='LDB Übersicht'!$AC$4),Legende!B107,IF(AND(H60>P52,'LDB Übersicht'!$E$4='LDB Übersicht'!$AC$5),Legende!C107,IF(AND(H60>P52,'LDB Übersicht'!$E$4='LDB Übersicht'!$AC$6),Legende!D107,\"\"))))","v":""},null,null,null,null,null,"Zurück","In Liste Übernehmen","Information zur Drosseleinstellung",null,null,null,"DLU",null,null,null,null,null,null,2.1171000000000002,1.9711000000000001,1.9613,2.0114999999999998,null,2.1171000000000002,1.9711000000000001,1.9613,2.0114999999999998]
[null,null,null,{"$f":"IF('LDB Übersicht'!$E$4='LDB Übersicht'!$AC$3,Legende!A71,IF('LDB Übersicht'!$E$4='LDB Übersicht'!$AC$4,Legende!B71,IF('LDB Übersicht'!$E$4='LDB Übersicht'!$AC$5,Legende!C71,IF('LDB Übersicht'!$E$4='LDB Übersicht'!$AC$6,Legende!D71,\"\"))))","v":"Sound pressure level in the room"},null,null,":",{"$f":"ROUNDDOWN(10*LOG(H52*10^(0.1*H50))-H58,1)","v":33.5},null,null,null,null,null,null,null,"Back","add to list","Information on throttle setting",null,null,null,null,null,null,null,null,null,null,2.0602999999999998,1.9172,1.9367000000000001,2.0524,null,2.0602999999999998,1.9172,1.9367000000000001,2.0524]
[null,null,null,null,null,null,null,null,null,null,null,null,null,null,null,"Retour","ajouter à la liste","Informations sur la manette des gaz",null,null,null,"GLEICHUNG","D=100","D=125","D=140","D=160","D=200"]
[null,null,null,null,null,null,null,null,null,null,null,null,null,null,null,"Indietro","Aggiungi alla lista","Informazioni sull'acceleratore",null,null,null,null,100,125,140,160,200]
[null,null,null,null,null,null,null,null,null,null,null,null,null,null,null,null,null,null,null,null,null,"FAKTOR",{"$f":"VLOOKUP(H44,$V$47:$AA$49,2,FALSE)","v":{"$error":"#N/A"}},{"$f":"VLOOKUP(H44,$V$47:$AA$49,3,FALSE)","v":{"$error":"#N/A"}},{"$f":"VLOOKUP(H44,$V$47:$AA$49,4,FALSE)","v":{"$error":"#N/A"}},{"$f":"VLOOKUP(H44,$V$47:$AA$49,5,FALSE)","v":{"$error":"#N/A"}},{"$f":"VLOOKUP(H44,$V$47:$AA$49,6,FALSE)","v":{"$error":"#N/A"}}]
[null,null,{"$f":"'LDB Übersicht'!D40","v":"© LTG Aktiengesellschaft: 28.07.2021 - LES - V1.5"},null,null,null,null,null,null,null,null,null,null,null,null,null,null,null,null,null,null,"EXPONENT",{"$f":"VLOOKUP(H44,$V$56:$AA$58,2,FALSE)","v":{"$error":"#N/A"}},{"$f":"VLOOKUP(H44,$V$56:$AA$58,3,FALSE)","v":{"$error":"#N/A"}},{"$f":"VLOOKUP(H44,$V$56:$AA$58,4,FALSE)","v":{"$error":"#N/A"}},{"$f":"VLOOKUP(H44,$V$56:$AA$58,5,FALSE)","v":{"$error":"#N/A"}},{"$f":"VLOOKUP(H44,$V$56:$AA$58,6,FALSE)","v":{"$error":"#N/A"}},{"$f":"+IF(AC64<0,0,AC64)","v":{"$error":"#N/A"}},{"$f":"+HLOOKUP(T4,W62:AA64,2,FALSE)*(R6/T6)^(HLOOKUP(T4,W62:AA64,3,FALSE))","v":{"$error":"#N/A"}}]
[null,null,{"$f":"'LDB Übersicht'!D41","v":"Information on tolerances and other specifications can be found in the current technical documentation."}]
[null,null,{"$f":"'LDB Übersicht'!D42","v":"You can find this at www.LTG.de. We cannot guarantee that the program is free from errors."}]

{"sheet":"Liste","index":3,"n_rows":112,"n_cols":29,"rows_kept":112,"cut":false,"hidden":false,"merged":[[7,15,9,18],[10,17,10,18],[5,2,5,3],[6,2,6,3],[11,6,11,7],[10,5,10,7],[10,11,10,16],[10,2,10,4],[10,8,10,10],[6,15,6,18],[5,4,5,5],[6,4,6,5],[2,15,2,18],[4,15,4,18],[5,15,5,18],[2,2,2,3],[3,2,3,3],[4,2,4,3],[2,4,2,5],[3,4,3,5],[4,4,4,5]]}
[]
[]
[null,null,{"$f":"'LDB Übersicht'!C7","v":"Date:"},null,{"$f":"IF('LDB Übersicht'!E7=\"\",\"\",'LDB Übersicht'!E7)","v":"2021-07-29"},null,null,null,null,null,null,null,null,null,null,null,null,null,null,null,null,{"$f":"IF('LDB Übersicht'!$E$4='LDB Übersicht'!$AC$3,V4,IF('LDB Übersicht'!$E$4='LDB Übersicht'!$AC$4,V5,IF('LDB Übersicht'!$E$4='LDB Übersicht'!$AC$5,V6,IF('LDB Übersicht'!$E$4='LDB Übersicht'!$AC$6,V7))))","v":"Print a list"},{"$f":"IF('LDB Übersicht'!$E$4='LDB Übersicht'!$AC$3,W4,IF('LDB Übersicht'!$E$4='LDB Übersicht'!$AC$4,W5,IF('LDB Übersicht'!$E$4='LDB Übersicht'!$AC$5,W6,IF('LDB Übersicht'!$E$4='LDB Übersicht'!$AC$6,W7))))","v":"Create tender text"},{"$f":"IF('LDB Übersicht'!$E$4='LDB Übersicht'!$AC$3,X4,IF('LDB Übersicht'!$E$4='LDB Übersicht'!$AC$4,X5,IF('LDB Übersicht'!$E$4='LDB Übersicht'!$AC$5,X6,IF('LDB Übersicht'!$E$4='LDB Übersicht'!$AC$6,X7))))","v":"Delete list"},{"$f":"IF('LDB Übersicht'!$E$4='LDB Übersicht'!$AC$3,Y4,IF('LDB Übersicht'!$E$4='LDB Übersicht'!$AC$4,Y5,IF('LDB Übersicht'!$E$4='LDB Übersicht'!$AC$5,Y6,IF('LDB Übersicht'!$E$4='LDB Übersicht'!$AC$6,Y7))))","v":"Sort list"},{"$f":"IF('LDB Übersicht'!$E$4='LDB Übersicht'!$AC$3,Z4,IF('LDB Übersicht'!$E$4='LDB Übersicht'!$AC$4,Z5,IF('LDB Übersicht'!$E$4='LDB Übersicht'!$AC$5,Z6,IF('LDB Übersicht'!$E$4='LDB Übersicht'!$AC$6,Z7))))","v":"Undo sorting"},{"$f":"IF('LDB Übersicht'!$E$4='LDB Übersicht'!$AC$3,AA4,IF('LDB Übersicht'!$E$4='LDB Übersicht'!$AC$4,AA5,IF('LDB Übersicht'!$E$4='LDB Übersicht'!$AC$5,AA6,IF('LDB Übersicht'!$E$4='LDB Übersicht'!$AC$6,AA7))))","v":"To overview"},{"$f":"IF('LDB Übersicht'!$E$4='LDB Übersicht'!$AC$3,AB4,IF('LDB Übersicht'!$E$4='LDB Übersicht'!$AC$4,AB5,IF('LDB Übersicht'!$E$4='LDB Übersicht'!$AC$5,AB6,IF('LDB Übersicht'!$E$4='LDB Übersicht'!$AC$6,AB7))))","v":"Generate PDF"},{"$f":"IF('LDB Übersicht'!$E$4='LDB Übersicht'!$AC$3,AC4,IF('LDB Übersicht'!$E$4='LDB Übersicht'!$AC$4,AC5,IF('LDB Übersicht'!$E$4='LDB Übersicht'!$AC$5,AC6,IF('LDB Übersicht'!$E$4='LDB Übersicht'!$AC$6,AC7))))","v":"Delete Pos. No."}]
[null,null,{"$f":"'LDB Übersicht'!C8","v":"Editor:"},null,{"$f":"IF('LDB Übersicht'!E8=\"\",\"\",'LDB Übersicht'!E8)","v":""},null,null,null,null,null,null,null,null,null,null,null,null,null,null,null,null,"Liste Drucken","Ausschreibungstext erstellen","Liste löschen","Liste sortieren","Sortierung rückgängig","Zur Startseite","PDF erzeugen","Pos. Nr. löschen"]
[null,null,{"$f":"'LDB Übersicht'!C9","v":"Project:"},null,{"$f":"IF('LDB Übersicht'!E9=\"\",\"\",'LDB Übersicht'!E9)","v":""},null,null,null,null,null,null,null,null,null,null,"E-Mail: Info@LTG.de ",null,null,null,null,null,"Print a list","Create tender text","Delete list","Sort list","Undo sorting","To overview","Generate PDF","Delete Pos. No."]
[null,null,{"$f":"'LDB Übersicht'!C10","v":"Variant:"},null,{"$f":"IF('LDB Übersicht'!E10=\"\",\"\",'LDB Übersicht'!E10)","v":""},null,null,null,null,null,null,null,null,null,null,"Tel. +49 (0)711 8201-0",null,null,null,null,null,"Imprimer une liste","Créer un texte d'appel d'offres","Supprimer la liste","Trier la liste","Annuler le tri","Vers l'aperçu","Générer un PDF","Supprimer Réf. No."]
[null,null,{"$f":"'LDB Übersicht'!C11","v":"Order number:"},null,{"$f":"IF('LDB Übersicht'!E11=\"\",\"\",'LDB Übersicht'!E11)","v":""},null,null,null,null,null,null,null,null,null,null,{"$f":"'LDB Übersicht'!D40","v":"© LTG Aktiengesellschaft: 28.07.2021 - LES - V1.5"},null,null,null,null,null,"Stampa un elenco","Crea un testo tenero","Elimina elenco","Ordina elenco","Annulla l'ordinamento","Alla panoramica","Genera PDF","Elimina Nr. Pos."]
[null,null,null,null,null,null,null,null,null,null,null,null,null,null,null,{"$f":"'LDB Übersicht'!D41 & \" \" & 'LDB Übersicht'!D42","v":"Information on tolerances and other specifications can be found in the current technical documentation. You can find this at www.LTG.de. We cannot guarantee that the program is free from errors."}]
[null,null,null,null,null,null,null,null,null,null,null,null,null,null,null,null,null,null,null,null,null,"Liste sortiert"]
[null,null,null,null,null,null,null,null,null,null,null,null,null,null,null,null,null,null,null,null,null,"Nein"]
[null,null,{"$f":"IF('LDB Übersicht'!$E$4='LDB Übersicht'!$AC$3,Legende!A85,IF('LDB Übersicht'!$E$4='LDB Übersicht'!$AC$4,Legende!B85,IF('LDB Übersicht'!$E$4='LDB Übersicht'!$AC$5,Legende!C85,IF('LDB Übersicht'!$E$4='LDB Übersicht'!$AC$6,Legende!D85,\"\"))))","v":"Reference"},null,null,{"$f":"IF('LDB Übersicht'!$E$4='LDB Übersicht'!$AC$3,Legende!A89,IF('LDB Übersicht'!$E$4='LDB Übersicht'!$AC$4,Legende!B89,IF('LDB Übersicht'!$E$4='LDB Übersicht'!$AC$5,Legende!C89,IF('LDB Übersicht'!$E$4='LDB Übersicht'!$AC$6,Legende!D89,\"\"))))","v":"LDB Type"},null,null,{"$f":"IF('LDB Übersicht'!$E$4='LDB Übersicht'!$AC$3,Legende!A92,IF('LDB Übersicht'!$E$4='LDB Übersicht'!$AC$4,Legende!B92,IF('LDB Übersicht'!$E$4='LDB Übersicht'!$AC$5,Legende!C92,IF('LDB Übersicht'!$E$4='LDB Übersicht'!$AC$6,Legende!D92,\"\"))))","v":"Linear diffuser"},null,null,{"$f":"IF('LDB Übersicht'!$E$4='LDB Übersicht'!$AC$3,Legende!A96,IF('LDB Übersicht'!$E$4='LDB Übersicht'!$AC$4,Legende!B96,IF('LDB Übersicht'!$E$4='LDB Übersicht'!$AC$5,Legende!C96,IF('LDB Übersicht'!$E$4='LDB Übersicht'!$AC$6,Legende!D96,\"\"))))","v":"Box Type"},null,null,null,null,null,{"$f":"IF('LDB Übersicht'!$E$4='LDB Übersicht'!$AC$3,Legende!A103,IF('LDB Übersicht'!$E$4='LDB Übersicht'!$AC$4,Legende!B103,IF('LDB Übersicht'!$E$4='LDB Übersicht'!$AC$5,Legende!C103,IF('LDB Übersicht'!$E$4='LDB Übersicht'!$AC$6,Legende!D103,\"\"))))","v":"Technical specifications"}]
[null,null,{"$f":"IF('LDB Übersicht'!$E$4='LDB Übersicht'!$AC$3,Legende!A86,IF('LDB Übersicht'!$E$4='LDB Übersicht'!$AC$4,Legende!B86,IF('LDB Übersicht'!$E$4='LDB Übersicht'!$AC$5,Legende!C86,IF('LDB Übersicht'!$E$4='LDB Übersicht'!$AC$6,Legende!D86,\"\"))))","v":"Pos. No."},{"$f":"IF('LDB Übersicht'!$E$4='LDB Übersicht'!$AC$3,Legende!A87,IF('LDB Übersicht'!$E$4='LDB Übersicht'!$AC$4,Legende!B87,IF('LDB Übersicht'!$E$4='LDB Übersicht'!$AC$5,Legende!C87,IF('LDB Übersicht'!$E$4='LDB Übersicht'!$AC$6,Legende!D87,\"\"))))","v":"Quantity"},{"$f":"IF('LDB Übersicht'!$E$4='LDB Übersicht'!$AC$3,Legende!A88,IF('LDB Übersicht'!$E$4='LDB Übersicht'!$AC$4,Legende!B88,IF('LDB Übersicht'!$E$4='LDB Übersicht'!$AC$5,Legende!C88,IF('LDB Übersicht'!$E$4='LDB Übersicht'!$AC$6,Legende!D88,\"\"))))","v":"Description"},{"$f":"IF('LDB Übersicht'!$E$4='LDB Übersicht'!$AC$3,Legende!A90,IF('LDB Übersicht'!$E$4='LDB Übersicht'!$AC$4,Legende!B90,IF('LDB Übersicht'!$E$4='LDB Übersicht'!$AC$5,Legende!C90,IF('LDB Übersicht'!$E$4='LDB Übersicht'!$AC$6,Legende!D90,\"\"))))","v":"Type"},{"$f":"IF('LDB Übersicht'!$E$4='LDB Übersicht'!$AC$3,Legende!A91,IF('LDB Übersicht'!$E$4='LDB Übersicht'!$AC$4,Legende!B91,IF('LDB Übersicht'!$E$4='LDB Übersicht'!$AC$5,Legende!C91,IF('LDB Übersicht'!$E$4='LDB Übersicht'!$AC$6,Legende!D91,\"\"))))","v":"Air flow rate"},null,{"$f":"IF('LDB Übersicht'!$E$4='LDB Übersicht'!$AC$3,Legende!A93,IF('LDB Übersicht'!$E$4='LDB Übersicht'!$AC$4,Legende!B93,IF('LDB Übersicht'!$E$4='LDB Übersicht'!$AC$5,Legende!C93,IF('LDB Übersicht'!$E$4='LDB Übersicht'!$AC$6,Legende!D93,\"\"))))","v":"Length of the linear diffusers"},{"$f":"IF('LDB Übersicht'!$E$4='LDB Übersicht'!$AC$3,Legende!A94,IF('LDB Übersicht'!$E$4='LDB Übersicht'!$AC$4,Legende!B94,IF('LDB Übersicht'!$E$4='LDB Übersicht'!$AC$5,Legende!C94,IF('LDB Übersicht'!$E$4='LDB Übersicht'!$AC$6,Legende!D94,\"\"))))","v":"End Caps\n(-): without\n(B): both sides\n(L):  left\n(R): right"},{"$f":"IF('LDB Übersicht'!$E$4='LDB Übersicht'!$AC$3,Legende!A95,IF('LDB Übersicht'!$E$4='LDB Übersicht'!$AC$4,Legende!B95,IF('LDB Übersicht'!$E$4='LDB Übersicht'!$AC$5,Legende!C95,IF('LDB Übersicht'!$E$4='LDB Übersicht'!$AC$6,Legende!D95,\"\"))))","v":"Installation without (O); \nFixing brackets (B); suspension bracket (DB); "},{"$f":"IF('LDB Übersicht'!$E$4='LDB Übersicht'!$AC$3,Legende!A97,IF('LDB Übersicht'!$E$4='LDB Übersicht'!$AC$4,Legende!B97,IF('LDB Übersicht'!$E$4='LDB Übersicht'!$AC$5,Legende!C97,IF('LDB Übersicht'!$E$4='LDB Übersicht'!$AC$6,Legende!D97,\"\"))))","v":"Without (-) narrow (S) longitudinal double box (D) angle  (W), Special (X)"},{"$f":"IF('LDB Übersicht'!$E$4='LDB Übersicht'!$AC$3,Legende!A98,IF('LDB Übersicht'!$E$4='LDB Übersicht'!$AC$4,Legende!B98,IF('LDB Übersicht'!$E$4='LDB Übersicht'!$AC$5,Legende!C98,IF('LDB Übersicht'!$E$4='LDB Übersicht'!$AC$6,Legende!D98,\"\"))))","v":"Subsequently installation  (O) or (M) Second Fix"},{"$f":"IF('LDB Übersicht'!$E$4='LDB Übersicht'!$AC$3,Legende!A99,IF('LDB Übersicht'!$E$4='LDB Übersicht'!$AC$4,Legende!B99,IF('LDB Übersicht'!$E$4='LDB Übersicht'!$AC$5,Legende!C99,IF('LDB Übersicht'!$E$4='LDB Übersicht'!$AC$6,Legende!D99,\"\"))))","v":"Sound absorber (-) or (S)"},{"$f":"IF('LDB Übersicht'!$E$4='LDB Übersicht'!$AC$3,Legende!A100,IF('LDB Übersicht'!$E$4='LDB Übersicht'!$AC$4,Legende!B100,IF('LDB Übersicht'!$E$4='LDB Übersicht'!$AC$5,Legende!C100,IF('LDB Übersicht'!$E$4='LDB Übersicht'!$AC$6,Legende!D100,\"\"))))","v":"number of spigot"},{"$f":"IF('LDB Übersicht'!$E$4='LDB Übersicht'!$AC$3,Legende!A101,IF('LDB Übersicht'!$E$4='LDB Übersicht'!$AC$4,Legende!B101,IF('LDB Übersicht'!$E$4='LDB Übersicht'!$AC$5,Legende!C101,IF('LDB Übersicht'!$E$4='LDB Übersicht'!$AC$6,Legende!D101,\"\"))))","v":"Spigot diameter"},{"$f":"IF('LDB Übersicht'!$E$4='LDB Übersicht'!$AC$3,Legende!A102,IF('LDB Übersicht'!$E$4='LDB Übersicht'!$AC$4,Legende!B102,IF('LDB Übersicht'!$E$4='LDB Übersicht'!$AC$5,Legende!C102,IF('LDB Übersicht'!$E$4='LDB Übersicht'!$AC$6,Legende!D102,\"\"))))","v":"Connection-Type"},{"$f":"IF('LDB Übersicht'!$E$4='LDB Übersicht'!$AC$3,Legende!A104,IF('LDB Übersicht'!$E$4='LDB Übersicht'!$AC$4,Legende!B104,IF('LDB Übersicht'!$E$4='LDB Übersicht'!$AC$5,Legende!C104,IF('LDB Übersicht'!$E$4='LDB Übersicht'!$AC$6,Legende!D104,\"\"))))","v":"sound power level"},{"$f":"IF('LDB Übersicht'!$E$4='LDB Übersicht'!$AC$3,Legende!A105,IF('LDB Übersicht'!$E$4='LDB Übersicht'!$AC$4,Legende!B105,IF('LDB Übersicht'!$E$4='LDB Übersicht'!$AC$5,Legende!C105,IF('LDB Übersicht'!$E$4='LDB Übersicht'!$AC$6,Legende!D105,\"\"))))","v":"pressure loss [Pa]"},null,null,null,null,null,null,null,"Drosselstellung","Schlitzanzahl"]
[1,null,1,null,null,null,null,null,null,null,null,null,null,null,null,null,null,null,null,null,null,null,null,null,null,null,"-",{"$f":"IF(OR(F13=\"LDB 12 small 1-schlitzig\",F13=\"LDB 12 clean 1-schlitzig\",F13=\"LDB 12 style 1-schlitzig\",F13=\"LDB 20 classic 1-schlitzig\",F13=\"LDB 50 maxx 1-schlitzig\"),\"1-schlitzig\",IF(OR(F13=\"LDB 12 clean 2-schlitzig\",F13=\"LDB 12 style 2-schlitzig\",F13=\"LDB 20 classic 2-schlitzig\",F13=\"LDB 50 maxx 2-schlitzig\"),\"2-schlitzig\",IF(OR(F13=\"LDB 12 clean 3-schlitzig\",F13=\"LDB 12 style 3-schlitzig\",F13=\"LDB 20 classic 3-schlitzig\",F13=\"LDB 50 maxx 3-schlitzig\"),\"3-schlitzig\",IF(OR(F13=\"LDB 12 clean 4-schlitzig\",F13=\"LDB 12 style 4-schlitzig\",F13=\"LDB 20 classic 4-schlitzig\"),\"4-schlitzig\",\"\"))))","v":""}]
[2,null,2,null,null,null,null,null,null,null,null,null,null,null,null,null,null,null,null,null,null,"Profilabschluss","Kasten","Schalldämpfer","Second fix","Aufhängung","45°",{"$f":"IF(OR(F14=\"LDB 12 small 1-schlitzig\",F14=\"LDB 12 clean 1-schlitzig\",F14=\"LDB 12 style 1-schlitzig\",F14=\"LDB 20 classic 1-schlitzig\",F14=\"LDB 50 maxx 1-schlitzig\"),\"1-schlitzig\",IF(OR(F14=\"LDB 12 clean 2-schlitzig\",F14=\"LDB 12 style 2-schlitzig\",F14=\"LDB 20 classic 2-schlitzig\",F14=\"LDB 50 maxx 2-schlitzig\"),\"2-schlitzig\",IF(OR(F14=\"LDB 12 clean 3-schlitzig\",F14=\"LDB 12 style 3-schlitzig\",F14=\"LDB 20 classic 3-schlitzig\",F14=\"LDB 50 maxx 3-schlitzig\"),\"3-schlitzig\",IF(OR(F14=\"LDB 12 clean 4-schlitzig\",F14=\"LDB 12 style 4-schlitzig\",F14=\"LDB 20 classic 4-schlitzig\"),\"4-schlitzig\",\"\"))))","v":""}]
[3,null,3,null,null,null,null,null,null,null,null,null,null,null,null,null,null,null,null,null,null,"-","-","-","O","O","-",""]
[4,null,4,null,null,null,null,null,null,null,null,null,null,null,null,null,null,null,null,null,null,"B","S","S","M","B","45°",""]
[5,null,5,null,null,null,null,null,null,null,null,null,null,null,null,null,null,null,null,null,null,"R","D",null,null,"DB","-",""]
[6,null,6,null,null,null,null,null,null,null,null,null,null,null,null,null,null,null,null,null,null,"L","X",null,null,null,"45°",""]
[7,null,7,null,null,null,null,null,null,null,null,null,null,null,null,null,null,null,null,null,null,null,"W",null,null,null,"45°",""]
[8,null,8,null,null,null,null,null,null,null,null,null,null,null,null,null,null,null,null,null,null,null,null,null,null,null,"45°",""]
[9,null,9,null,null,null,null,null,null,null,null,null,null,null,null,null,null,null,null,null,null,null,null,null,null,null,"45°",""]
[10,null,10,null,null,null,null,null,null,null,null,null,null,null,null,null,null,null,null,null,null,null,null,null,null,null,"45°",""]
[11,null,11,null,null,null,null,null,null,null,null,null,null,null,null,null,null,null,null,null,null,null,null,null,null,null,"45°",""]
[12,null,12,null,null,null,null,null,null,null,null,null,null,null,null,null,null,null,null,null,null,null,null,null,null,null,"45°",""]
[13,null,13,null,null,null,null,null,null,null,null,null,null,null,null,null,null,null,null,null,null,null,null,null,null,null,"45°",""]
[14,null,14,null,null,null,null,null,null,null,null,null,null,null,null,null,null,null,null,null,null,null,null,null,null,null,"-",""]
[15,null,15,null,null,null,null,null,null,null,null,null,null,null,null,null,null,null,null,null,null,null,null,null,null,null,"-",""]
[16,null,16,null,null,null,null,null,null,null,null,null,null,null,null,null,null,null,null,null,null,null,null,null,null,null,"-",""]
[17,null,17,null,null,null,null,null,null,null,null,null,null,null,null,null,null,null,null,null,null,null,null,null,null,null,null,""]
[18,null,18,null,null,null,null,null,null,null,null,null,null,null,null,null,null,null,null,null,null,null,null,null,null,null,null,""]
[19,null,19,null,null,null,null,null,null,null,null,null,null,null,null,null,null,null,null,null,null,null,null,null,null,null,null,""]
[20,null,20,null,null,null,null,null,null,null,null,null,null,null,null,null,null,null,null,null,null,null,null,null,null,null,null,""]
[21,null,21,null,null,null,null,null,null,null,null,null,null,null,null,null,null,null,null,null,null,null,null,null,null,null,null,""]
[22,null,22,null,null,null,null,null,null,null,null,null,null,null,null,null,null,null,null,null,null,null,null,null,null,null,null,""]
[23,null,23,null,null,null,null,null,null,null,null,null,null,null,null,null,null,null,null,null,null,null,null,null,null,null,null,""]
[24,null,24,null,null,null,null,null,null,null,null,null,null,null,null,null,null,null,null,null,null,null,null,null,null,null,null,""]
[25,null,25,null,null,null,null,null,null,null,null,null,null,null,null,null,null,null,null,null,null,null,null,null,null,null,null,""]
[26,null,26,null,null,null,null,null,null,null,null,null,null,null,null,null,null,null,null,null,null,null,null,null,null,null,null,""]
[27,null,27,null,null,null,null,null,null,null,null,null,null,null,null,null,null,null,null,null,null,null,null,null,null,null,null,""]
[28,null,28,null,null,null,null,null,null,null,null,null,null,null,null,null,null,null,null,null,null,null,null,null,null,null,null,""]
[29,null,29,null,null,null,null,null,null,null,null,null,null,null,null,null,null,null,null,null,null,null,null,null,null,null,null,""]
[30,null,30,null,null,null,null,null,null,null,null,null,null,null,null,null,null,null,null,null,null,null,null,null,null,null,null,""]
[31,null,31,null,null,null,null,null,null,null,null,null,null,null,null,null,null,null,null,null,null,null,null,null,null,null,null,""]
[32,null,32,null,null,null,null,null,null,null,null,null,null,null,null,null,null,null,null,null,null,null,null,null,null,null,null,""]
[33,null,33,null,null,null,null,null,null,null,null,null,null,null,null,null,null,null,null,null,null,null,null,null,null,null,null,""]
[34,null,34,null,null,null,null,null,null,null,null,null,null,null,null,null,null,null,null,null,null,null,null,null,null,null,null,""]
[35,null,35,null,null,null,null,null,null,null,null,null,null,null,null,null,null,null,null,null,null,null,null,null,null,null,null,""]
[36,null,36,null,null,null,null,null,null,null,null,null,null,null,null,null,null,null,null,null,null,null,null,null,null,null,null,""]
[37,null,37,null,null,null,null,null,null,null,null,null,null,null,null,null,null,null,null,null,null,null,null,null,null,null,null,""]
[38,null,38,null,null,null,null,null,null,null,null,null,null,null,null,null,null,null,null,null,null,null,null,null,null,null,null,""]
[39,null,39,null,null,null,null,null,null,null,null,null,null,null,null,null,null,null,null,null,null,null,null,null,null,null,null,""]
[40,null,40,null,null,null,null,null,null,null,null,null,null,null,null,null,null,null,null,null,null,null,null,null,null,null,null,""]
[41,null,41,null,null,null,null,null,null,null,null,null,null,null,null,null,null,null,null,null,null,null,null,null,null,null,null,""]
[42,null,42,null,null,null,null,null,null,null,null,null,null,null,null,null,null,null,null,null,null,null,null,null,null,null,null,""]
[43,null,43,null,null,null,null,null,null,null,null,null,null,null,null,null,null,null,null,null,null,null,null,null,null,null,null,""]
[44,null,44,null,null,null,null,null,null,null,null,null,null,null,null,null,null,null,null,null,null,null,null,null,null,null,null,""]
[45,null,45,null,null,null,null,null,null,null,null,null,null,null,null,null,null,null,null,null,null,null,null,null,null,null,null,""]
[46,null,46,null,null,null,null,null,null,null,null,null,null,null,null,null,null,null,null,null,null,null,null,null,null,null,null,""]
[47,null,47,null,null,null,null,null,null,null,null,null,null,null,null,null,null,null,null,null,null,null,null,null,null,null,null,""]
[48,null,48,null,null,null,null,null,null,null,null,null,null,null,null,null,null,null,null,null,null,null,null,null,null,null,null,""]
[49,null,49,null,null,null,null,null,null,null,null,null,null,null,null,null,null,null,null,null,null,null,null,null,null,null,null,""]
[50,null,50,null,null,null,null,null,null,null,null,null,null,null,null,null,null,null,null,null,null,null,null,null,null,null,null,""]
[51,null,51,null,null,null,null,null,null,null,null,null,null,null,null,null,null,null,null,null,null,null,null,null,null,null,null,""]
[52,null,52,null,null,null,null,null,null,null,null,null,null,null,null,null,null,null,null,null,null,null,null,null,null,null,null,""]
[53,null,53,null,null,null,null,null,null,null,null,null,null,null,null,null,null,null,null,null,null,null,null,null,null,null,null,""]
[54,null,54,null,null,null,null,null,null,null,null,null,null,null,null,null,null,null,null,null,null,null,null,null,null,null,null,""]
[55,null,55,null,null,null,null,null,null,null,null,null,null,null,null,null,null,null,null,null,null,null,null,null,null,null,null,""]
[56,null,56,null,null,null,null,null,null,null,null,null,null,null,null,null,null,null,null,null,null,null,null,null,null,null,null,""]
[57,null,57,null,null,null,null,null,null,null,null,null,null,null,null,null,null,null,null,null,null,null,null,null,null,null,null,""]
[58,null,58,null,null,null,null,null,null,null,null,null,null,null,null,null,null,null,null,null,null,null,null,null,null,null,null,""]
[59,null,59,null,null,null,null,null,null,null,null,null,null,null,null,null,null,null,null,null,null,null,null,null,null,null,null,""]
[60,null,60,null,null,null,null,null,null,null,null,null,null,null,null,null,null,null,null,null,null,null,null,null,null,null,null,""]
[61,null,61,null,null,null,null,null,null,null,null,null,null,null,null,null,null,null,null,null,null,null,null,null,null,null,null,""]
[62,null,62,null,null,null,null,null,null,null,null,null,null,null,null,null,null,null,null,null,null,null,null,null,null,null,null,""]
[63,null,63,null,null,null,null,null,null,null,null,null,null,null,null,null,null,null,null,null,null,null,null,null,null,null,null,""]
[64,null,64,null,null,null,null,null,null,null,null,null,null,null,null,null,null,null,null,null,null,null,null,null,null,null,null,""]
[65,null,65,null,null,null,null,null,null,null,null,null,null,null,null,null,null,null,null,null,null,null,null,null,null,null,null,""]
[66,null,66,null,null,null,null,null,null,null,null,null,null,null,null,null,null,null,null,null,null,null,null,null,null,null,null,{"$f":"IF(OR(F78=\"LDB 12 small 1-schlitzig\",F78=\"LDB 12 clean 1-schlitzig\",F78=\"LDB 12 style 1-schlitzig\",F78=\"LDB 20 classic 1-schlitzig\",F78=\"LDB 50 maxx 1-schlitzig\"),\"1-schlitzig\",IF(OR(F78=\"LDB 12 clean 2-schlitzig\",F78=\"LDB 12 style 2-schlitzig\",F78=\"LDB 20 classic 2-schlitzig\",F78=\"LDB 50 maxx 2-schlitzig\"),\"2-schlitzig\",IF(OR(F78=\"LDB 12 clean 3-schlitzig\",F78=\"LDB 12 style 3-schlitzig\",F78=\"LDB 20 classic 3-schlitzig\",F78=\"LDB 50 maxx 3-schlitzig\"),\"3-schlitzig\",IF(OR(F78=\"LDB 12 clean 4-schlitzig\",F78=\"LDB 12 style 4-schlitzig\",F78=\"LDB 20 classic 4-schlitzig\"),\"4-schlitzig\",\"\"))))","v":""}]
[67,null,67,null,null,null,null,null,null,null,null,null,null,null,null,null,null,null,null,null,null,null,null,null,null,null,null,""]
[68,null,68,null,null,null,null,null,null,null,null,null,null,null,null,null,null,null,null,null,null,null,null,null,null,null,null,""]
[69,null,69,null,null,null,null,null,null,null,null,null,null,null,null,null,null,null,null,null,null,null,null,null,null,null,null,""]
[70,null,70,null,null,null,null,null,null,null,null,null,null,null,null,null,null,null,null,null,null,null,null,null,null,null,null,""]
[71,null,71,null,null,null,null,null,null,null,null,null,null,null,null,null,null,null,null,null,null,null,null,null,null,null,null,""]
[72,null,72,null,null,null,null,null,null,null,null,null,null,null,null,null,null,null,null,null,null,null,null,null,null,null,null,""]
[73,null,73,null,null,null,null,null,null,null,null,null,null,null,null,null,null,null,null,null,null,null,null,null,null,null,null,""]
[74,null,74,null,null,null,null,null,null,null,null,null,null,null,null,null,null,null,null,null,null,null,null,null,null,null,null,""]
[75,null,75,null,null,null,null,null,null,null,null,null,null,null,null,null,null,null,null,null,null,null,null,null,null,null,null,""]
[76,null,76,null,null,null,null,null,null,null,null,null,null,null,null,null,null,null,null,null,null,null,null,null,null,null,null,""]
[77,null,77,null,null,null,null,null,null,null,null,null,null,null,null,null,null,null,null,null,null,null,null,null,null,null,null,""]
[78,null,78,null,null,null,null,null,null,null,null,null,null,null,null,null,null,null,null,null,null,null,null,null,null,null,null,""]
[79,null,79,null,null,null,null,null,null,null,null,null,null,null,null,null,null,null,null,null,null,null,null,null,null,null,null,""]
[80,null,80,null,null,null,null,null,null,null,null,null,null,null,null,null,null,null,null,null,null,null,null,null,null,null,null,""]
[81,null,81,null,null,null,null,null,null,null,null,null,null,null,null,null,null,null,null,null,null,null,null,null,null,null,null,""]
[82,null,82,null,null,null,null,null,null,null,null,null,null,null,null,null,null,null,null,null,null,null,null,null,null,null,null,""]
[83,null,83,null,null,null,null,null,null,null,null,null,null,null,null,null,null,null,null,null,null,null,null,null,null,null,null,""]
[84,null,84,null,null,null,null,null,null,null,null,null,null,null,null,null,null,null,null,null,null,null,null,null,null,null,null,""]
[85,null,85,null,null,null,null,null,null,null,null,null,null,null,null,null,null,null,null,null,null,null,null,null,null,null,null,""]
[86,null,86,null,null,null,null,null,null,null,null,null,null,null,null,null,null,null,null,null,null,null,null,null,null,null,null,""]
[87,null,87,null,null,null,null,null,null,null,null,null,null,null,null,null,null,null,null,null,null,null,null,null,null,null,null,""]
[88,null,88,null,null,null,null,null,null,null,null,null,null,null,null,null,null,null,null,null,null,null,null,null,null,null,null,""]
[89,null,89,null,null,null,null,null,null,null,null,null,null,null,null,null,null,null,null,null,null,null,null,null,null,null,null,""]
[90,null,90,null,null,null,null,null,null,null,null,null,null,null,null,null,null,null,null,null,null,null,null,null,null,null,null,""]
[91,null,91,null,null,null,null,null,null,null,null,null,null,null,null,null,null,null,null,null,null,null,null,null,null,null,null,""]
[92,null,92,null,null,null,null,null,null,null,null,null,null,null,null,null,null,null,null,null,null,null,null,null,null,null,null,""]
[93,null,93,null,null,null,null,null,null,null,null,null,null,null,null,null,null,null,null,null,null,null,null,null,null,null,null,""]
[94,null,94,null,null,null,null,null,null,null,null,null,null,null,null,null,null,null,null,null,null,null,null,null,null,null,null,""]
[95,null,95,null,null,null,null,null,null,null,null,null,null,null,null,null,null,null,null,null,null,null,null,null,null,null,null,""]
[96,null,96,null,null,null,null,null,null,null,null,null,null,null,null,null,null,null,null,null,null,null,null,null,null,null,null,""]
[97,null,97,null,null,null,null,null,null,null,null,null,null,null,null,null,null,null,null,null,null,null,null,null,null,null,null,""]
[98,null,98,null,null,null,null,null,null,null,null,null,null,null,null,null,null,null,null,null,null,null,null,null,null,null,null,""]
[99,null,99,null,null,null,null,null,null,null,null,null,null,null,null,null,null,null,null,null,null,null,null,null,null,null,null,""]
[100,null,100,null,null,null,null,null,null,null,null,null,null,null,null,null,null,null,null,null,null,null,null,null,null,null,null,""]

{"sheet":"Legende","index":4,"n_rows":108,"n_cols":4,"rows_kept":108,"cut":false,"hidden":true,"merged":[]}
["Deutsch","English","Francais","Italiano"]
["Projekt:","Project:","Projet:","Progetto:"]
["Variante:","Variant:","Variante:","Variante:"]
["Bearbeiter:","Editor:","Éditeur:","Editore:"]
["Datum:","Date:","Date:","Data:"]
["Bestellnummer:","Order number:","Numéro de commande:","Numero d'ordine:"]
["LTG Schlitzdurchlässe Typ LDB und LDB System Clean","LTG Linear Diffusers Type LDB and LDB System Clean","LTG Diffuseurs linéaires type LDB et LDB Système CLEAN","Diffusori lineari LTG tipo LDB e LDB System clean"]
["Sprache:","language:","Langue:","linguaggio:"]
["Einheit:","unit:","unité:","unità:"]
["Raumdaten:","Room data:","Donées du Local:","Dati del locale:"]
["Raumbezeichnung:","Room name:","Designation du Local:","Identificazione del locale:"]
["Soll-Gesamtvolumenstrom:","Target total air flow rate:","Debit d`air demandée:","Portata aria di progetto:"]
["Raumlufttemperatur:","Room air temperature:","Temperature ambient:","Temperatura ambiente:"]
["Zulufttemperatur:","Supply air temperature:","Température de soufflage:","Temperatura dell'aria di mandata:"]
["Raum-Schallabsorption:","Room sound absorpion:","Attenuation du local:","Attenuazione sonora del locale:"]
["Max. zulässiger Schalldruckpegel im Raum:","Sound pressure level limit in the room:","Niveau sonore permis:","Pressione sonora massima amnessa nel locale:"]
["Kühlleistung:","Cooling capacity:","Puissance frigorifique:","Potenza frigorifera:"]
["<= Auswahl (mit Doppelklick)","<= Selected (with double click)","<= Sélection (avec double clic)","<= Selezione (con doppio clic)"]
["LDB Typ","LDB Type","Designation du type LDB","Tipo di LDB"]
["Einbauhöhe H=2,80 m, LDB 50maxx H = 5,00 m","Installation height H=2,80 m, LDB 50maxx H = 5,00 m","hauteur installation H=2,8 m, LDB 50maxx H = 5,00 m","Altezza di installazione H=2,8m, LDB 50maxx H=5,00m"]
["LDB 12 small","LDB 12 small","LDB 12 petit","LDB 12 piccolo"]
["LDB 12 clean","LDB 12 clean","LDB 12 propre","LDB 12 pulito"]
["LDB 12 style","LDB 12 style","LDB 12 style","LDB 12 stile"]
["LDB 20 classic","LDB 20 classic","LDB 20 classique","LDB 20 classico"]
["LDB 50 maxx","LDB 50 maxx","LDB 50 maxx","LDB 50 maxx"]
["1-schlitzig","1-slot","1-emplacement","1-slot"]
["2-schlitzig","2-slot","2-emplacements","2-slot"]
["3-schlitzig","3-slot","3-emplacements","3-slot"]
["4-schlitzig","4-slot","4-emplacements","4-slot"]
["Spezifischer Volumenstrom","Specific air flow rate","Debit d`air specifique par 1 m","Portata aria specifica"]
["Empfehlung max.","Recommen-dation max.","Recommandation maxi.","Massima raccomandata"]
["Schlitzlänge Element","Diffuser element length","Longuer diffuseur par element","Lunghezza diffusore"]
["Stückzahl","Quantity","Quantité","Quantità"]
["Schlitzlänge Gesamt Raum","Diffuser length total room","Longueur diffuseur total par local","Lunghezza totale diffusori nel locale "]
["Druckverlust","Pressure loss","Perte pression","Caduta di pressione "]
["Strahl-Ausbreitung Zuluft","Jet spreading supply air ","Penetration du jet de l`air neuf","Larghezza del getto aria di mandata"]
["Max. Luft-Geschwind.","Max. air velocity","Velocité maximale","Velocità massima aria "]
["Aufentaltszone","Occupied zone","Zone occupé","Zona occupata"]
["Zugluft-risiko","Draught risk","Risque vitesse trop elevé","Rischio spiffero"]
["Kategorie gemäß DIN EN ISO 7730","Category       DIN EN ISO 7730","Classe sélon DIN EN ISO 7730","Categoria secondo DIN EN ISO 7730"]
["Bewertung der thermischen Behaglichkeit","Evaluation of thermal comfort","Variante","Valutazione comfort termico"]
["Stck.","pc.","pc.","pz."]
["A-bewerteter Schall-leistungs-pegel pro Element","A-rated sound power level per element","Niveau puissance sonore par element","Potenza scala A del singolo elemento diffusore"]
["Ist-Gesamt- volumen- strom","Actual total air flow rate","Debit d´air totale","Portata aria totale "]
["Schalldruckpegel im Raum","Sound pressure level in the room","Niveau pression sonore du local","Pressione sonora risultante nel locale"]
["Akustische Daten der Standard-Konfiguration (LDBsmall, LDBmaxx: ohne Drossel = SDA; LDBclean, LDBstyle, LDBclassic: Drossel = DLU (100% offen))","Acoustic data of the standard configuration (LDBsmall, LDBmaxx: without throttle = SDA; LDBclean, LDBstyle, LDBclassic: throttle = DLU (100% open))","Données acoustiques de la configuration standard (LDBsmall, LDBmaxx: sans manette de gaz = SDA; LDBclean, LDBstyle, LDBclassic: manette de gaz = DLU (100% ouvert))","Dati acustici della configurazione standard (LDBsmall, LDBmaxx: senza acceleratore = SDA; LDBclean, LDBstyle, LDBclassic: acceleratore = DLU (100% aperto))"]
["Eine Fehlerfreiheit des Programms kann nicht zugesichert werden. Im Zweifel gelten die technischen Daten der aktuellen LTG Bauteilmappe.","Accuracy of selection software can not be ensured. In case of doubts data of LTG technical literature is valid.","Sous Réserve des erreurs du programme, en cas de doute il faut utiliser les données techniques du prospectus valable","La mancanza di errori del programma non può essere garantita. In caso di dubbio restano validi i dati riportati sulle schede tecniche aggiornate"]
["Aus Programmierfehlern entstandener Schaden geht nicht zu Lasten der LTG. Technische Änderungen im Rahmen der Weiterentwicklung vorbehalten.","Damage caused by programming errors is not at LTG expenses. Subject to technical specifications.","LTG Aktiengesellschaft refuse la résponsabilite d`erreurs de programmer y compris Dommage eventuel causé par le programme.","Danni per errori nei programmi di selezione non possono essere addebitati a LTG. Ci si riserva il diritto di modifiche tecniche in seguito a futuri sviluppi del prodotto"]
["Raumabmessungen:","Room dimensions:","Dimensions du local","Dimensioni ambiente"]
["Breite:","Width:","Largueur","Larghezza"]
["Höhe:","Height:","Hauteur","Altezza"]
["Tiefe:","Depth:","Longueur","Profondità"]
["Gewählte Nachhallzeit:","Selected reverberation period:","Temps du reverbation choisi","Periodo di riverberazione considerato"]
["Äquivalente Absorptionsfläche:","Equivalent absorption area:","Equivalent Surface Absorbtion","Area equivalente di assorbimento"]
["Raum-Schallabsorption:","Room sound absorpion:","Attenuation du local:","Attenuazione sonora del locale:"]
["Raumbezeichnung","Room name","Designation du Local","Identificazione del locale"]
["Stutzenanzahl [Stck]","No. of spigots [pc]","Nombre Piquages","Numero attacchi aria [pz.]"]
["Stutzendurchmesser [mm]","Spigot diameter [mm]","Diametre Piquage","Diametro attacchi aria [mm]"]
["Volumenstrom","Air flow rate","Debit d`air","Portata aria"]
["Zulufttemperatur","Supply air temperature","Température de soufflage","Temperatura dell'aria di mandata"]
["Profilabschluss","End Caps","Achèvement du profil","Tipo di terminali di testa"]
["Kastentyp","Box Type","Type de boîte","Tipo di plenum"]
["int. Schalldämpferkulisse","sound absorber","Porte silencieux","Assorbitore acustico interno"]
["Nachträglich Befestigung (Sec. Fix)","Subsequently installation  (Sec. Fix)","Pièce jointe ultérieure (Sec. Fix)","Second-Fix: feritoie smontabili"]
["Anschluss - Typ","Connection-Type","Type de connexion","Tipo di attacco dell'aria"]
["Drossel-Einstellung","throttle damper","Réglage de l'accélérateur","Taratura serranda"]
["Druckverlust","Pressure loss","Perte pression","Caduta di pressione "]
["A-bewerteter Schallleistungspegel","A-rated sound power level","Niveau puissance sonore ","Potenza sonora in scala A"]
["Gesamtvolumenstrom","Actual total air flow rate","Debit d´air totale","Portata aria totale "]
["Raum-Schallabsorption","Room sound absorpion","Attenuation du local","Attenuazione sonora del locale"]
["Schalldruckpegel im Raum","Sound pressure level in the room","Niveau pression sonore du local","Pressione sonora risultante nel locale"]
["© LTG Aktiengesellschaft: 28.07.2021 - LES - V1.5","© LTG Aktiengesellschaft: 28.07.2021 - LES - V1.5","© LTG Aktiengesellschaft: 28.07.2021 - LES - V1.5","© LTG Aktiengesellschaft: 28.07.2021 - LES - V1.5"]
["Angaben zu Toleranzen sowie weitere Spezifikationen  sind der aktuellen Technischen Dokumentation zu entnehmen.","Information on tolerances and other specifications can be found in the current technical documentation.","Des informations sur les tolérances et autres spécifications se trouvent dans la documentation technique actuelle.","Informazioni sulle tolleranze e altre specifiche possono essere trovate nella documentazione tecnica attuale."]
["Diese finden Sie auf www.LTG.de. Eine Fehlerfreiheit des Programms kann nicht zugesichert werden.","You can find this at www.LTG.de. We cannot guarantee that the program is free from errors.","Vous pouvez le trouver sur www.LTG.de. Nous ne pouvons pas garantir que le programme est exempt d'erreurs.","Puoi trovarlo su www.LTG.de. Non possiamo garantire che il programma sia privo di errori."]
["Aus Programmierfehlern entstandener Schaden geht nicht zu Lasten der LTG. Technische Änderungen im Rahmen der Weiterentwicklung vorbehalten.","LTG is not responsible for any damage resulting from programming errors. Subject to technical changes in the course of further development.","LTG n'est pas responsable des dommages résultant d'erreurs de programmation. Sous réserve de modifications techniques en cours de développement.","LTG non è responsabile per eventuali danni derivanti da errori di programmazione. Soggetto a modifiche tecniche nel corso di ulteriori sviluppi."]
["Kanalquerschnitt vor Empfangsraum Zuluft:","Canal cross-section in front of the reception room supply air:","Coupe transversale du canal devant la salle de réception air soufflé:","sezione del canale davanti alla sala di ricevimento aria di alimentazione:"]
["Kanalquerschnitt vor Empfangsraum Abluft:","Canal cross-section in front of the reception room exhaust air:","Coupe transversale du canal devant la salle de réception air extrait:","sezione del canale davanti alla sala di ricevimento aria di ripresa:"]
["Auswahl","Selection","Sélection","Selezione"]
["Ergebnis","Result","Résultat","Risultato"]
["Volumenstrom je Luftart","Volume flow per air type","Débit volumique par type d'air","Portata in volume per tipo di aria"]
["Einbauort","Installation location","Emplacement d'installation","Luogo di installazione"]
["Raumnutzung / Geschoss","Use of space / floor","Utilisation de l'espace / du sol","Uso dello spazio / pavimento"]
["Alternative (mit Doppelklick)","Alternative (with double click)","Alternative (avec double clic)","Alternativo (con doppio clic)"]
["Auswahl / Alternative","Selection / Alternative","Sélection / Alternative","Selezione / Alternativo"]
["Referenz","Reference","Référence","Riferimento"]
["Pos. Nr.","Pos. No.","Réf. No.","Nr. Pos."]
["Stückzahl","Quantity","Quantité","Quantità"]
["Bezeichnung","Description","Désignation","Denominazione"]
["LDB Typ","LDB Type","Designation du type LDB","Tipo di LDB"]
["Typ","Type","Type","Tipo"]
["Volumenstrom","Air flow rate","Debit d`air","Portata aria"]
["Schlitzauslassschiene","Linear diffuser","Diffuse linéairement","Diffusore lineare"]
["Länge des Schlitzauslasses","Length of the linear diffusers","Longueur des diffuseurs linéaires","Lunghezza del diffusore"]
["Profilabschluss \n(-): ohne\n(B): beidseitig\n(L):  links  \n(R): rechts","End Caps\n(-): without\n(B): both sides\n(L):  left\n(R): right","Achèvement du profil \n(-): sans pour autant\n(B): des deux côtés \n(L): gauche \n(R): droite","Terminali di testa \n(-): senza\n(B): su entrambi i lati\n(L):  sinistra  \n(R): destra"]
["Aufhängung ohne (O); \nAufhängebügel (B); Doppelbügel (DB) (nur für Blindbefestigung ohne Luftverteilkasten)","Installation without (O); \nFixing brackets (B); suspension bracket (DB); ","Suspension sans (O);\nSupport de suspension (B); Support double (DB) (uniquement pour montage en aveugle sans boîte de distribution d'air)","Senza pendinatura (O); \nArchetti (B); archetti doppo (DB) (solo per diffusori ciechi senza plenum)"]
["Luftverteilkasten","Box Type","Boîte de distribution d'air","Plenum di distribuzione"]
["Ohne Kasten (-) , mit Kasten Typ Standard (S) , Doppelkasten (D) , Sonderkasten (X) oder Winkelstück (W)","Without (-) narrow (S) longitudinal double box (D) angle  (W), Special (X)","'Sans (-) étroit (S) double caisson longitudinal (D) angle (W), spécial (X)","Senza plenum (-), con plenum standard (S), con plenum doppio (D), plenum speciale (X) o pezzo ad angolo (W)"]
["Nachträglich Befestigung Kasten+Schiene (O) oder (M) mit Second Fix Befestigung","Subsequently installation  (O) or (M) Second Fix","Fixation ultérieure boîte + rail (O) ou (M) avec fixation Second Fix","Montaggio diffusore - plenum in in secndo momento: senza (O), con sistema Second-Fix (M)"]
["Integr. Schalldämpfer  (-) oder (S) mit Schalldämpfer (Brandschutzklasse B1)","Sound absorber (-) or (S)","Absorbeur de bruit (-) ou (S)","Assorbitore acustico integrato: senza (-), con (S) (classe di resistenza al fuoco B1)"]
["Anzahl Stutzen","number of spigot","nombre de spigot","Numero attacchi aria"]
["Stutzengrößen","Spigot diameter","Diamètre de la broche","Diamtro attacchi"]
["Anschluss - Typ","Connection-Type","Type de connexion","Tipo di attacco dell'aria"]
["Technische Daten","Technical specifications","Spécifications techniques","Specifiche tecniche"]
["A-bewerteter Schallleistungspegel pro Element dB(A)","sound power level","niveau de puissance acoustique","Potenza sonora in scala A del singolo elemento diffusore"]
["Druckverlust [Pa]","pressure loss [Pa]","La chute de pression [Pa]","Perdita di carico [Pa]"]
["Aufhängung (nur Blindauslass)","Blind attachment","Suspension (sortie aveugle uniquement)","Sospensione (solo diffusore cieco)"]
["Achtung: Schalldruckpegel im Raum ist höher als max. zulässiger Schalldruckpegel im Raum","Attention: The sound pressure level in the room is higher than the max.permissible sound pressure level in the room","Attention: le niveau de pression acoustique dans la pièce est supérieur au niveau de pression acoustique maximal autorisé dans la pièce","Attenzione: il livello di pressione sonora nella stanza è superiore al livello di pressione sonora massimo consentito nella stanza"]
["Zuluftuntertemperatur","Supply air under temperature","Air soufflé sous température","Aria di mandata sotto temperatura"]